{"text_format":"3","workbook":"xlsx","n_sheets":16,"sheets":["Cover","Contents","Instructions","Scenarios","Location & Climate","Cum RF Calcs","Climate Assumptions","Interventions","Soil Chemical","Soil physical","Vegetation","Lists","Scenarios Combined","Data Form","Results","Output"],"not_rendered":{"charts":12,"images":1,"macros":1,"defined_names":28,"comments":9},"read":"whole","date_system":"1900"}

{"sheet":"Cover","index":0,"n_rows":21,"n_cols":3,"rows_kept":21,"merged":[[7,2,7,3],[10,2,10,3]]}
[]
[]
[]
[]
[]
[]
[null,null,"VIP-Rehab"]
[null,null,"Sustainable Mine Rehabilitation Calculator"]
[]
[]
[null,null,"An interactive model to explore the risk or erosion following mine site rehabilitation through the outcome of alternative rehabilitation design scenarios using Bayesian modelling"]
[]
[]
[null,null,"ACARP Project C240331 and C28044"]
[]
[null,null,"V9.1"]
[null,null,"2021-06-17"]
[]
[]
[]
[null,null,"Click for contents"]

{"sheet":"Contents","index":1,"n_rows":20,"n_cols":3,"rows_kept":20}
[]
[null,"Contents & Workflow"]
[]
[]
[null,"Cover","Index sheet"]
[null,"Instructions","Model instructions"]
[null,"Scenarios","A summary of the scenarios modelled"]
[null,"Location & Climate","Site location and climate data"]
[null,"Cum RF Calculations","Cumulative rainfall calculations"]
[null,"Climate Assumptions","Climate modelling assumptions"]
[null,"Interventions","Rehabilitation design interventions"]
[null,"Soil Chemical","Soil chemical attributes (from laboratory analysis)"]
[null,"Soil Physical","Soil physical attributes (from laboratory analysis)"]
[null,"Vegetation","Vegetatation structure and nutrient status"]
[null,"Lists","Drop down reference lists"]
[null,"Scenarios Combined","A summary of the data inputs for each scenario"]
[null,"Data Form","Netica data entry form (compiled from data inputs)"]
[null,"Mine rehab erosion risk tool","https://mine-rehabilitation.net.au/"]
[null,"Results","Raw data results from Netica"]
[null,"Outputs","Netica model outputs for each modelled scenario"]

{"sheet":"Instructions","index":2,"n_rows":58,"n_cols":2,"rows_kept":58}
["Data entry and error checking"]
[1,"Each attribute of rehabilitation design or site characteristic is a \"Node\" in the model"]
[2,"Each Node in the model is categorised into a number of possible \"States\""]
[3,"All data for each \"State\" of a \"Node\" is entered as either a categorical variable or continuous value."]
[4,"All categorical variables are selected from drop-down menus in clear (unshaded) cells."]
[5,"All continuous values are entered in green shaded cells.  All entry values are supported by automated error checking.  Cells with out-of-range values will be shaded red.  Cells with in-range values will remain shaded green."]
[6,"Do not copy and paste data from outside the workbook.  Enter values or select drop-downs directly.  Alternate scenarios may be compiled by copy and pasting columns within the workbook."]
[7,"Continuous values will be automatically categorised into classes by the model.  The range of each class for continuous variables is detailed in the help note for the respective variable."]
[8,"Every cell in the data sheet must have either: \n   (i) a categorical value; \n   (ii) a numerical value; or \n   (iii) a hyphen (-) if unknown.  \nNo cell can be left blank. "]
["Scenarios"]
[1,"Select a climate description from the drop-down menu for each scenario"]
[2,"Enter a description of each scenario to differentiate conditions or planned treatments at a site."]
["Location & Climate"]
[1,"The model can simulate erosion outcomes for only one site at a time.  For each site, the model can evaluate up to 20 scenarios simultaneously.  A new data input file is required for each different location."]
[2,"Enter the latitude and longitude in degrees, minutes and seconds for the centroid of the target site.  Alternatively, enter the decimal degrees in the \"Degrees\" line only.  The program will use this to automatically access the climate data for the site."]
[3,"Climate data is automatically filled using a Macro.  If this function doesn’t work, it will be necessary to change your computer's Macros settings:\n     > Select \"File\"\n     > Select \"Options\"\n     > Select \"Trust Centre\"\n     > Select \"Trust Centre Settings\"\n     > Select \"Macro Settings\"\n     > Select \"Disable all Macros with notification\"\n     > Click \"OK\""]
["Cumulative Rainfall Calculations"]
[1,"No action required.  This sheet automatically calculates the likely cumulative rainfall for 36 two month periods and three rainfall intensity options:  Low (Decile 1); Average and High (Decile 9).  Results provide input to the Climate Assumptions sheet."]
["Climate Assumptions"]
[1,"The model allows simulation of conditions in a Low (Decile 1); Average (Average); and High (Decile 9) rainfall year.  These rainfall conditions are selected from a drop-down menu for each scenario."]
[2,"The probability of an erosive rainfall event (>50mm/hr) is an inherent characteristic of the site.  This will be accessed automatically from the BOM website."]
[3,"Gypsum is activated by rainfall after application.  Enter the month and date of planned gypsum application.  The program will automatically calculate the likely cumulative rainfall 2 months after the planned application."]
["Interventions"]
[1,"A range of interventions are incorporated in the model reflecting common design criteria. The \"State\" of each intervention can be selected to explore the effect of different rehabilitation design features."]
[2,"Interventions to soil are applied to three layers:  Layer 1 = Topsoil; Layer 2 = Upper 50cm of Spoil;  Layer 3 = Spoil below 50cm depth.  Layer 3 is rarely used (select \"-\" if not used)."]
["Soil Chemical"]
[1,"Enter soil and spoil chemical attributes from the average of soil and spoil analysis results for the site being modelled"]
[2,"Soil and Spoil chemical characteristics relate to three layers:  Layer 1 = Topsoil; Layer 2 = Upper 50cm of Spoil;  Layer 3 = Spoil below 50cm depth.  Layer 3 is rarely used (select \"-\" if not used)."]
[3,"Scenarios may include the expected soil attributes after amelioration."]
["Soil Physical"]
[1,"Enter soil and spoil physical attributes from the average of soil and spoil analysis results for the site being modelled"]
[2,"Soil and Spoil physical characteristics relate to two layers:  Layer 1 = Topsoil; Layer 2 = Upper 50cm of Spoil.  Layer 3 is rarely used (select \"-\" if not used)."]
["Vegetation"]
[1,"Select the state of soil condition attributes that directly affect vegetation cover (Soil nutrient status and topsoil organic matter)"]
[2,"Select the state of the vegetation cover attributes targeted as an outcome of rehabilitation and revegetation activities.  This should be considered as the state of vegetation that would be revealed by monitoring results 12 months after revegetation."]
["Lists"]
[1,"No action required.  This sheet is for drop-down menu lists"]
["Scenarios combined"]
[1,"No action required.  This sheet collates all data inputs"]
["Data form"]
[1,"This step involves compiling the data form ready to run in the Mine Reabilitation Erosion Risk Tool"]
[2,"Open the data form tab"]
[3,"In the \"File\" tab, select save a copy, click on \"Save as\", then select \"CSV (Comma delimited) (*.csv)\" from the drop down menu"]
[4,"The data form is now ready to upload to the Mine Reabilitation Erosion Risk Tool"]
["Web Tool","Runnining the mine rehabilitaton erosion risk tool "]
[1,"Open the website:  https://mine-rehabilitation.net.au/"]
[2,"Log in and click on the \"Batch slope performance\" button from the tools menu"]
[3,"Click in the box under \"Verterra Netica Integration\" and navigate to the data form saved as csv to upload.  Alternatively, drag and drop the data form into the box "]
[4,"The Mine Rehabilitation Erosion Risk Tool will process the data and return the results as a .csv file.  This may take a few minutes.  If the results workbook doesn’t appear at the bottom of the browser window, it may be found in your computer's \"Downloads\" folder."]
["Results"]
[1,"Open the raw results form (.csv) from above and copy all columns with values"]
[2,"Open the \"Results\" tab in this workbook, and paste in the raw results, starting in the top left corner (cell A1)"]
[3,"Delete any columns that do not relate to a tested scenario."]
["Output"]
[1,"Open the \"Output\" tab from this workbook"]
[2,"The results will be displayed in tabualar and graphical format"]
[3,"If additional results colums are required:\n     i. insert columns to the left of the shaded column\n     ii. Drag the right-most results column to fill the space created"]
[4,"Review data output.  The preferred scenario has the lowest relative erosion risk."]

{"sheet":"Scenarios","index":3,"n_rows":22,"n_cols":3,"rows_kept":22}
[]
["Scenario number","Climate Description","Scenario Description"]
["Scenario 01: ",{"$f":"'Climate Assumptions'!F$3","v":"Average Year"},"1. Pre-amendment"]
["Scenario 02: ",{"$f":"'Climate Assumptions'!G$3","v":"Average Year"},"2. Rock mulch treatment"]
["Scenario 03: ",{"$f":"'Climate Assumptions'!H$3","v":"Average Year"},"3. Post-amendment"]
["Scenario 04: ",{"$f":"'Climate Assumptions'!I$3","v":"Average Year"},"4. Post-amendment (Reduced treatment depth)"]
["Scenario 05: ",{"$f":"'Climate Assumptions'!J$3","v":"Average Year"},"5. Post-amendment (Reduced treatment ESP)"]
["Scenario 06: ",{"$f":"'Climate Assumptions'!K$3","v":"Average Year"},"6. Post-amendment (Reduced treatment depth and ESP)"]
["Scenario 07: ",{"$f":"'Climate Assumptions'!L$3","v":"-"},"-"]
["Scenario 08: ",{"$f":"'Climate Assumptions'!M$3","v":"-"},"-"]
["Scenario 09: ",{"$f":"'Climate Assumptions'!N$3","v":"-"},"-"]
["Scenario 10: ",{"$f":"'Climate Assumptions'!O$3","v":"-"},"-"]
["Scenario 11: ",{"$f":"'Climate Assumptions'!P$3","v":"-"},"-"]
["Scenario 12: ",{"$f":"'Climate Assumptions'!Q$3","v":"-"},"-"]
["Scenario 13: ",{"$f":"'Climate Assumptions'!R$3","v":"-"},"-"]
["Scenario 14: ",{"$f":"'Climate Assumptions'!S$3","v":"-"},"-"]
["Scenario 15: ",{"$f":"'Climate Assumptions'!T$3","v":"-"},"-"]
["Scenario 16: ",{"$f":"'Climate Assumptions'!U$3","v":"-"},"-"]
["Scenario 17: ",{"$f":"'Climate Assumptions'!V$3","v":"-"},"-"]
["Scenario 18: ",{"$f":"'Climate Assumptions'!W$3","v":"-"},"-"]
["Scenario 19: ",{"$f":"'Climate Assumptions'!X$3","v":"-"},"-"]
["Scenario 20: ",{"$f":"'Climate Assumptions'!Y$3","v":"-"},"-"]

{"sheet":"Location & Climate","index":4,"n_rows":41,"n_cols":15,"rows_kept":41,"merged":[[6,9,6,10],[7,9,7,10],[9,5,10,7]]}
[]
[null,"Location"]
[null,"Site name"]
[null,"Lake Lindsay"]
[]
[null,"Centroid for location"]
[null,"Coordinates","Latitude","Longitude",{"$nulls":5},"User input",null,null,"Note: pressing the button will clear your edit history"]
[null,"Degrees",-23,147.3,{"$nulls":5},"Auto input (macro)",null,null,"YOU WILL NOT BE ABLE TO UNDO CHANGES"]
[null,"Minutes",0,0]
[null,"Seconds",0,0]
[null,"Decimal coordinates",{"$f":"C8+(C9/60)+(C10/3600)","v":{"v":-23,"d":"-23.00"}},{"$f":"D8+(D9/60)+(D10/3600)","v":{"v":147.3,"d":"147.30"}}]
[]
[null,"Rainfall variability"]
[null,"Rainfall Summary","Decile 1 year","Average Year","Decile 9 Year"]
[null,"Annual rainfall (mm/yr)",{"$f":"O20","v":47.37},{"$f":"O19","v":{"v":606.978996424921,"d":"607"}},{"$f":"O21","v":{"v":1347.4899999999998,"d":"1347"}}]
[]
[null,"Monthly averages"]
[null,"Climate parameters","Jan","Feb","Mar","Apr","May","Jun","Jul","Aug","Sep","Oct","Nov","Dec","Totals"]
[null,"Average monthly rainfall (mm)",{"v":109.14831460674,"d":"109.1"},{"v":109.62840909091,"d":"109.6"},{"v":62.242045454545,"d":"62.2"},{"v":32.640909090909,"d":"32.6"},{"v":33.934090909091,"d":"33.9"},{"v":28.953409090909,"d":"29.0"},{"v":29.675,"d":"29.7"},{"v":19.85,"d":"19.9"},{"v":16.667045454545,"d":"16.7"},{"v":35.279545454545,"d":"35.3"},{"v":53.722727272727,"d":"53.7"},{"v":75.2375,"d":"75.2"},{"$f":"SUM(Rain)","v":{"v":606.978996424921,"d":"607"}}]
[null,"Decile 1 monthly rainfall (mm)",{"v":20.89,"d":"20.9"},11.2,{"v":0.48,"d":"0.5"},{"v":0,"d":"0.0"},{"v":0,"d":"0.0"},{"v":0,"d":"0.0"},{"v":0,"d":"0.0"},{"v":0,"d":"0.0"},{"v":0,"d":"0.0"},{"v":0.16,"d":"0.2"},{"v":2,"d":"2.0"},{"v":12.64,"d":"12.6"},{"$f":"SUM(Rain10)","v":{"v":47.37,"d":"47"}}]
[null,"Decile 9 monthly rainfall (mm)",{"v":197.41,"d":"197.4"},240.6,{"v":160.92,"d":"160.9"},{"v":88.12,"d":"88.1"},{"v":79.84,"d":"79.8"},65.3,{"v":76.72,"d":"76.7"},49.3,{"v":43.64,"d":"43.6"},77.2,117.3,{"v":151.14,"d":"151.1"},{"$f":"SUM(Rain90)","v":{"v":1347.4899999999998,"d":"1347"}}]
[null,"Mean monthly evap. (mm)",{"v":230.48426966292,"d":"230.5"},{"v":186.45113636364,"d":"186.5"},{"v":192.15795454545,"d":"192.2"},{"v":149.9375,"d":"149.9"},{"v":113.34659090909,"d":"113.3"},{"v":88.278409090909,"d":"88.3"},{"v":98.432954545455,"d":"98.4"},{"v":131.70909090909,"d":"131.7"},{"v":177.29659090909,"d":"177.3"},{"v":225.19545454545,"d":"225.2"},{"v":235.4375,"d":"235.4"},{"v":251.75795454545,"d":"251.8"},{"$f":"SUM(Evap)","v":{"v":2080.4854060265443,"d":"2080"}}]
[null,"Mean maximum temperature (oC)",39.9,36.4,34.8,31.2,28.7,{"v":25,"d":"25.0"},25.2,29.1,31.9,34.7,35.7,37.3,{"$f":"AVERAGE(MaxT)","v":{"v":32.49166666666666,"d":"32"}}]
[null,"Mean minimum termperature (oC)",{"v":18,"d":"18.0"},18.4,16.2,11.6,6.8,2.9,2.6,3.6,7.8,12.1,16.2,17.8,{"$f":"AVERAGE(MinT)","v":{"v":11.166666666666664,"d":"11"}}]
[]
[null,"Rainfall Intensity, Frequency, Duration (IFD) - Probabilty of greater than 50mm/hr"]
[null,"Annual exceedance probability AEP (1 in x)",1.58,2,5,10,20,50,100]
[null,"Annual exceedance probability (AEP) (%)",63.2,50,20,10,5,2,1]
[null,"Model Class","Very High","Very High","High","High","Moderate","Moderate","Low"]
[null,"Annual return interval (ARI)",1,1.44,4.48,9.49,20,50,100]
[null,"Exceedance per year (EY)",1,0.69,0.22,0.11,0.05,0.02,0.01]
[null,"1 hour duration",31.3,35.3,48.1,56.9,65.7,77.7,{"v":87,"d":"87.0"}]
[null,"Threshold rainfall (mm/hr)",50,50,50,50,50,50,50]
[null,"Rainfall/hr greater than threshold (mm)",{"$f":"IF(C32-C33<0,\"\",C32-C33)","v":""},{"$f":"IF(D32-D33<0,\"\",D32-D33)","v":""},"",6.899999999999999,15.700000000000003,27.700000000000003,37]
[null,"Probabilty of greater than theshold (50mm/hr)",{"$f":"SUM(IF(C34:I34=(MIN(C34:I34)),C27:I27,0))","v":10}]
[null,"IFD Class",{"$f":"HLOOKUP(C35,C28:I29,2,FALSE)","v":"High"}]
[]
[null,"Data links"]
[null,"Link to BOM climate averages","http://www.bom.gov.au/climate/data/index.shtml?bookmark=200"]
[null,"Link to BOM rainfall IFD","http://www.bom.gov.au/water/designRainfalls/revised-ifd/?year=2016"]
[null,"Explanation of rainfall IFD","http://www.bom.gov.au/water/designRainfalls/ifd/ifd-faq.shtml#sec1q5"]

{"sheet":"Cum RF Calcs","index":5,"n_rows":48,"n_cols":19,"rows_kept":48}
["Cumulative Rainfall 2 month after Gypsum Treatment"]
["Cumulative Rainfall Calcs - Decile 1 year","Month",null,null,"January","February","March","April","May","June","July","August","September","October","November","December",null,"CumulativeRainfall_2month1","Cumulative rainfall"]
[null,"Days per month","Start","End",31,28,31,30,31,30,31,31,30,31,30,31,null,"Very Low"," 0 - 25 mm"]
[null,"Decile 1 Monthly Rainfall",null,null,{"$f":"'Location & Climate'!C20","v":{"v":20.89,"d":"21"}},{"$f":"'Location & Climate'!D20","v":{"v":11.2,"d":"11"}},{"$f":"'Location & Climate'!E20","v":{"v":0.48,"d":"0"}},{"$f":"'Location & Climate'!F20","v":0},{"$f":"'Location & Climate'!G20","v":0},{"$f":"'Location & Climate'!H20","v":0},{"$f":"'Location & Climate'!I20","v":0},{"$f":"'Location & Climate'!J20","v":0},{"$f":"'Location & Climate'!K20","v":0},{"$f":"'Location & Climate'!L20","v":{"v":0.16,"d":"0"}},{"$f":"'Location & Climate'!M20","v":2},{"$f":"'Location & Climate'!N20","v":{"v":12.64,"d":"13"}},null,"Low","25 - 75 mm"]
["Decile 1 Year10","Start (1-10)",1,10,{"$f":"SUM(E4:F4)","v":{"v":32.09,"d":"32"}},{"$f":"SUM(F4:G4)","v":{"v":11.68,"d":"12"}},{"$f":"SUM(G4:H4)","v":{"v":0.48,"d":"0"}},{"$f":"SUM(H4:I4)","v":0},{"$f":"SUM(I4:J4)","v":0},{"$f":"SUM(J4:K4)","v":0},{"$f":"SUM(K4:L4)","v":0},{"$f":"SUM(L4:M4)","v":0},{"$f":"SUM(M4:N4)","v":{"v":0.16,"d":"0"}},{"$f":"SUM(N4:O4)","v":{"v":2.16,"d":"2"}},{"$f":"SUM(O4:P4)","v":{"v":14.64,"d":"15"}},{"$f":"P4+E4","v":{"v":33.53,"d":"34"}},null,"Moderate","75 - 120 mm"]
["Decile 1 Year20","Middle (10-20)",11,20,{"$f":"E4/2+F4+G4/2","v":{"v":21.884999999999998,"d":"22"}},{"$f":"F4/2+G4+H4/2","v":{"v":6.08,"d":"6"}},{"$f":"G4/2+H4+I4/2","v":{"v":0.24,"d":"0"}},{"$f":"H4/2+I4+J4/2","v":0},{"$f":"I4/2+J4+K4/2","v":0},{"$f":"J4/2+K4+L4/2","v":0},{"$f":"K4/2+L4+M4/2","v":0},{"$f":"L4/2+M4+N4/2","v":{"v":0.08,"d":"0"}},{"$f":"M4/2+N4+O4/2","v":{"v":1.16,"d":"1"}},{"$f":"N4/2+O4+P4/2","v":{"v":8.4,"d":"8"}},{"$f":"O4/2+P4+E4/2","v":{"v":24.085,"d":"24"}},{"$f":"P4/2+E4+F4/2","v":{"v":32.81,"d":"33"}},null,"High","120 - 250 mm"]
["Decile 1 Year31","End (20-31)",21,31,{"$f":"F4+G4","v":{"v":11.68,"d":"12"}},{"$f":"G4+H4","v":{"v":0.48,"d":"0"}},{"$f":"H4+I4","v":0},{"$f":"I4+J4","v":0},{"$f":"J4+K4","v":0},{"$f":"K4+L4","v":0},{"$f":"L4+M4","v":0},{"$f":"M4+N4","v":{"v":0.16,"d":"0"}},{"$f":"N4+O4","v":{"v":2.16,"d":"2"}},{"$f":"O4+P4","v":{"v":14.64,"d":"15"}},{"$f":"P4+E4","v":{"v":33.53,"d":"34"}},{"$f":"E4+F4","v":{"v":32.09,"d":"32"}},null,"Very High","250 - 500 mm"]
[]
[]
["Cumulative Rainfall Calcs - Average year","Month",null,null,"January","February","March","April","May","June","July","August","September","October","November","December"]
[null,"Days per month","Start","End",31,28,31,30,31,30,31,31,30,31,30,31]
[null,"Av Monthly Rainfall",null,null,{"$f":"'Location & Climate'!C19","v":{"v":109.14831460674,"d":"109"}},{"$f":"'Location & Climate'!D19","v":{"v":109.62840909091,"d":"110"}},{"$f":"'Location & Climate'!E19","v":{"v":62.242045454545,"d":"62"}},{"$f":"'Location & Climate'!F19","v":{"v":32.640909090909,"d":"33"}},{"$f":"'Location & Climate'!G19","v":{"v":33.934090909091,"d":"34"}},{"$f":"'Location & Climate'!H19","v":{"v":28.953409090909,"d":"29"}},{"$f":"'Location & Climate'!I19","v":{"v":29.675,"d":"30"}},{"$f":"'Location & Climate'!J19","v":{"v":19.85,"d":"20"}},{"$f":"'Location & Climate'!K19","v":{"v":16.667045454545,"d":"17"}},{"$f":"'Location & Climate'!L19","v":{"v":35.279545454545,"d":"35"}},{"$f":"'Location & Climate'!M19","v":{"v":53.722727272727,"d":"54"}},{"$f":"'Location & Climate'!N19","v":{"v":75.2375,"d":"75"}}]
["Average Year10","Start (1-10)",1,10,{"$f":"SUM(E12:F12)","v":{"v":218.77672369765,"d":"219"}},{"$f":"SUM(F12:G12)","v":{"v":171.870454545455,"d":"172"}},{"$f":"SUM(G12:H12)","v":{"v":94.882954545454,"d":"95"}},{"$f":"SUM(H12:I12)","v":{"v":66.57499999999999,"d":"67"}},{"$f":"SUM(I12:J12)","v":{"v":62.887499999999996,"d":"63"}},{"$f":"SUM(J12:K12)","v":{"v":58.628409090909,"d":"59"}},{"$f":"SUM(K12:L12)","v":{"v":49.525000000000006,"d":"50"}},{"$f":"SUM(L12:M12)","v":{"v":36.517045454545,"d":"37"}},{"$f":"SUM(M12:N12)","v":{"v":51.946590909090006,"d":"52"}},{"$f":"SUM(N12:O12)","v":{"v":89.002272727272,"d":"89"}},{"$f":"SUM(O12:P12)","v":{"v":128.960227272727,"d":"129"}},{"$f":"P12+E12","v":{"v":184.38581460673998,"d":"184"}}]
["Average Year20","Middle (10-20)",11,20,{"$f":"E12/2+F12+G12/2","v":{"v":195.3235891215525,"d":"195"}},{"$f":"F12/2+G12+H12/2","v":{"v":133.37670454545452,"d":"133"}},{"$f":"G12/2+H12+I12/2","v":{"v":80.728977272727,"d":"81"}},{"$f":"H12/2+I12+J12/2","v":{"v":64.73124999999999,"d":"65"}},{"$f":"I12/2+J12+K12/2","v":{"v":60.757954545454496,"d":"61"}},{"$f":"J12/2+K12+L12/2","v":{"v":54.076704545454504,"d":"54"}},{"$f":"K12/2+L12+M12/2","v":{"v":43.0210227272725,"d":"43"}},{"$f":"L12/2+M12+N12/2","v":{"v":44.2318181818175,"d":"44"}},{"$f":"M12/2+N12+O12/2","v":{"v":70.474431818181,"d":"70"}},{"$f":"N12/2+O12+P12/2","v":{"v":108.9812499999995,"d":"109"}},{"$f":"O12/2+P12+E12/2","v":{"v":156.67302093973348,"d":"157"}},{"$f":"P12/2+E12+F12/2","v":{"v":201.581269152195,"d":"202"}}]
["Average Year30","End (20-31)",21,31,{"$f":"F12+G12","v":{"v":171.870454545455,"d":"172"}},{"$f":"G12+H12","v":{"v":94.882954545454,"d":"95"}},{"$f":"H12+I12","v":{"v":66.57499999999999,"d":"67"}},{"$f":"I12+J12","v":{"v":62.887499999999996,"d":"63"}},{"$f":"J12+K12","v":{"v":58.628409090909,"d":"59"}},{"$f":"K12+L12","v":{"v":49.525000000000006,"d":"50"}},{"$f":"L12+M12","v":{"v":36.517045454545,"d":"37"}},{"$f":"M12+N12","v":{"v":51.946590909090006,"d":"52"}},{"$f":"N12+O12","v":{"v":89.002272727272,"d":"89"}},{"$f":"O12+P12","v":{"v":128.960227272727,"d":"129"}},{"$f":"P12+E12","v":{"v":184.38581460673998,"d":"184"}},{"$f":"E12+F12","v":{"v":218.77672369765,"d":"219"}}]
[]
[]
["Cumulative Rainfall Calcs - Decile 9 year","Month",null,null,"January","February","March","April","May","June","July","August","September","October","November","December"]
[null,"Days per month","Start","End",31,28,31,30,31,30,31,31,30,31,30,31]
[null,"Decile 9 Monthly Rainfall",null,null,{"$f":"'Location & Climate'!C21","v":{"v":197.41,"d":"197"}},{"$f":"'Location & Climate'!D21","v":{"v":240.6,"d":"241"}},{"$f":"'Location & Climate'!E21","v":{"v":160.92,"d":"161"}},{"$f":"'Location & Climate'!F21","v":{"v":88.12,"d":"88"}},{"$f":"'Location & Climate'!G21","v":{"v":79.84,"d":"80"}},{"$f":"'Location & Climate'!H21","v":{"v":65.3,"d":"65"}},{"$f":"'Location & Climate'!I21","v":{"v":76.72,"d":"77"}},{"$f":"'Location & Climate'!J21","v":{"v":49.3,"d":"49"}},{"$f":"'Location & Climate'!K21","v":{"v":43.64,"d":"44"}},{"$f":"'Location & Climate'!L21","v":{"v":77.2,"d":"77"}},{"$f":"'Location & Climate'!M21","v":{"v":117.3,"d":"117"}},{"$f":"'Location & Climate'!N21","v":{"v":151.14,"d":"151"}}]
["Decile 9 Year10","Start (1-10)",1,10,{"$f":"SUM(E20:F20)","v":{"v":438.01,"d":"438"}},{"$f":"SUM(F20:G20)","v":{"v":401.52,"d":"402"}},{"$f":"SUM(G20:H20)","v":{"v":249.04,"d":"249"}},{"$f":"SUM(H20:I20)","v":{"v":167.96,"d":"168"}},{"$f":"SUM(I20:J20)","v":{"v":145.14,"d":"145"}},{"$f":"SUM(J20:K20)","v":{"v":142.01999999999998,"d":"142"}},{"$f":"SUM(K20:L20)","v":{"v":126.02,"d":"126"}},{"$f":"SUM(L20:M20)","v":{"v":92.94,"d":"93"}},{"$f":"SUM(M20:N20)","v":{"v":120.84,"d":"121"}},{"$f":"SUM(N20:O20)","v":{"v":194.5,"d":"195"}},{"$f":"SUM(O20:P20)","v":{"v":268.44,"d":"268"}},{"$f":"P20+E20","v":{"v":348.54999999999995,"d":"349"}}]
["Decile 9 Year20","Middle (10-20)",11,20,{"$f":"E20/2+F20+G20/2","v":{"v":419.765,"d":"420"}},{"$f":"F20/2+G20+H20/2","v":{"v":325.28,"d":"325"}},{"$f":"G20/2+H20+I20/2","v":{"v":208.5,"d":"209"}},{"$f":"H20/2+I20+J20/2","v":{"v":156.55,"d":"157"}},{"$f":"I20/2+J20+K20/2","v":{"v":143.57999999999998,"d":"144"}},{"$f":"J20/2+K20+L20/2","v":{"v":134.02,"d":"134"}},{"$f":"K20/2+L20+M20/2","v":{"v":109.47999999999999,"d":"109"}},{"$f":"L20/2+M20+N20/2","v":{"v":106.88999999999999,"d":"107"}},{"$f":"M20/2+N20+O20/2","v":{"v":157.67000000000002,"d":"158"}},{"$f":"N20/2+O20+P20/2","v":{"v":231.47,"d":"231"}},{"$f":"O20/2+P20+E20/2","v":{"v":308.495,"d":"308"}},{"$f":"P20/2+E20+F20/2","v":{"v":393.28000000000003,"d":"393"}}]
["Decile 9 Year30","End (20-31)",21,31,{"$f":"F20+G20","v":{"v":401.52,"d":"402"}},{"$f":"G20+H20","v":{"v":249.04,"d":"249"}},{"$f":"H20+I20","v":{"v":167.96,"d":"168"}},{"$f":"I20+J20","v":{"v":145.14,"d":"145"}},{"$f":"J20+K20","v":{"v":142.01999999999998,"d":"142"}},{"$f":"K20+L20","v":{"v":126.02,"d":"126"}},{"$f":"L20+M20","v":{"v":92.94,"d":"93"}},{"$f":"M20+N20","v":{"v":120.84,"d":"121"}},{"$f":"N20+O20","v":{"v":194.5,"d":"195"}},{"$f":"O20+P20","v":{"v":268.44,"d":"268"}},{"$f":"P20+E20","v":{"v":348.54999999999995,"d":"349"}},{"$f":"E20+F20","v":{"v":438.01,"d":"438"}}]
[]
[]
["Cumulative Rainfall 2 month prior to Gypsum Treatment"]
["Cumulative Rainfall Calcs - Decile 1 year","Month",null,null,"January","February","March","April","May","June","July","August","September","October","November","December"]
[null,"Days per month","Start","End",31,28,31,30,31,30,31,31,30,31,30,31]
[null,"Decile 1 Monthly Rainfall",null,null,{"$f":"'Location & Climate'!C20","v":{"v":20.89,"d":"21"}},{"$f":"'Location & Climate'!D20","v":{"v":11.2,"d":"11"}},{"$f":"'Location & Climate'!E20","v":{"v":0.48,"d":"0"}},{"$f":"'Location & Climate'!F20","v":0},{"$f":"'Location & Climate'!G20","v":0},{"$f":"'Location & Climate'!H20","v":0},{"$f":"'Location & Climate'!I20","v":0},{"$f":"'Location & Climate'!J20","v":0},{"$f":"'Location & Climate'!K20","v":0},{"$f":"'Location & Climate'!L20","v":{"v":0.16,"d":"0"}},{"$f":"'Location & Climate'!M20","v":2},{"$f":"'Location & Climate'!N20","v":{"v":12.64,"d":"13"}}]
["Decile 1 Year10","Start (1-10)",1,10,{"$f":"E29+P29","v":{"v":33.53,"d":"34"}},{"$f":"SUM(E29:F29)","v":{"v":32.09,"d":"32"}},{"$f":"SUM(F29:G29)","v":{"v":11.68,"d":"12"}},{"$f":"SUM(G29:H29)","v":{"v":0.48,"d":"0"}},{"$f":"SUM(H29:I29)","v":0},{"$f":"SUM(I29:J29)","v":0},{"$f":"SUM(J29:K29)","v":0},{"$f":"SUM(K29:L29)","v":0},{"$f":"SUM(L29:M29)","v":0},{"$f":"SUM(M29:N29)","v":{"v":0.16,"d":"0"}},{"$f":"SUM(N29:O29)","v":{"v":2.16,"d":"2"}},{"$f":"SUM(O29:P29)","v":{"v":14.64,"d":"15"}}]
["Decile 1 Year20","Middle (10-20)",11,20,{"$f":"E29/2+P29+O29/2","v":{"v":24.085,"d":"24"}},{"$f":"F29/2+E29+P29/2","v":{"v":32.81,"d":"33"}},{"$f":"G29/2+F29+E29/2","v":21.884999999999998},{"$f":"H29/2+G29+F29/2","v":{"v":6.08,"d":"6"}},{"$f":"I29/2+H29+G29/2","v":{"v":0.24,"d":"0"}},{"$f":"J29/2+I29+H29/2","v":0},{"$f":"K29/2+J29+I29/2","v":0},{"$f":"L29/2+K29+J29/2","v":0},{"$f":"M29/2+L29+K29/2","v":0},{"$f":"N29/2+M29+L29/2","v":{"v":0.08,"d":"0"}},{"$f":"O29/2+N29+M29/2","v":{"v":1.16,"d":"1"}},{"$f":"P29/2+O29+N29/2","v":{"v":8.4,"d":"8"}}]
["Decile 1 Year31","End (20-31)",21,31,{"$f":"O29+P29","v":{"v":14.64,"d":"15"}},{"$f":"E29+P29","v":{"v":33.53,"d":"34"}},{"$f":"E29+F29","v":{"v":32.09,"d":"32"}},{"$f":"F29+G29","v":{"v":11.68,"d":"12"}},{"$f":"G29+H29","v":{"v":0.48,"d":"0"}},{"$f":"H29+I29","v":0},{"$f":"I29+J29","v":0},{"$f":"J29+K29","v":0},{"$f":"K29+L29","v":0},{"$f":"L29+M29","v":0},{"$f":"M29+N29","v":{"v":0.16,"d":"0"}},{"$f":"N29+O29","v":{"v":2.16,"d":"2"}}]
[]
[]
["Cumulative Rainfall Calcs - Average year","Month",null,null,"January","February","March","April","May","June","July","August","September","October","November","December"]
[null,"Days per month","Start","End",31,28,31,30,31,30,31,31,30,31,30,31]
[null,"Av Monthly Rainfall",null,null,{"$f":"'Location & Climate'!C19","v":{"v":109.14831460674,"d":"109"}},{"$f":"'Location & Climate'!D19","v":{"v":109.62840909091,"d":"110"}},{"$f":"'Location & Climate'!E19","v":{"v":62.242045454545,"d":"62"}},{"$f":"'Location & Climate'!F19","v":{"v":32.640909090909,"d":"33"}},{"$f":"'Location & Climate'!G19","v":{"v":33.934090909091,"d":"34"}},{"$f":"'Location & Climate'!H19","v":{"v":28.953409090909,"d":"29"}},{"$f":"'Location & Climate'!I19","v":{"v":29.675,"d":"30"}},{"$f":"'Location & Climate'!J19","v":{"v":19.85,"d":"20"}},{"$f":"'Location & Climate'!K19","v":{"v":16.667045454545,"d":"17"}},{"$f":"'Location & Climate'!L19","v":{"v":35.279545454545,"d":"35"}},{"$f":"'Location & Climate'!M19","v":{"v":53.722727272727,"d":"54"}},{"$f":"'Location & Climate'!N19","v":{"v":75.2375,"d":"75"}}]
["Average Year10","Start (1-10)",1,10,{"$f":"E37+P37","v":{"v":184.38581460673998,"d":"184"}},{"$f":"SUM(E37:F37)","v":{"v":218.77672369765,"d":"219"}},{"$f":"SUM(F37:G37)","v":{"v":171.870454545455,"d":"172"}},{"$f":"SUM(G37:H37)","v":{"v":94.882954545454,"d":"95"}},{"$f":"SUM(H37:I37)","v":{"v":66.57499999999999,"d":"67"}},{"$f":"SUM(I37:J37)","v":{"v":62.887499999999996,"d":"63"}},{"$f":"SUM(J37:K37)","v":{"v":58.628409090909,"d":"59"}},{"$f":"SUM(K37:L37)","v":{"v":49.525000000000006,"d":"50"}},{"$f":"SUM(L37:M37)","v":{"v":36.517045454545,"d":"37"}},{"$f":"SUM(M37:N37)","v":{"v":51.946590909090006,"d":"52"}},{"$f":"SUM(N37:O37)","v":{"v":89.002272727272,"d":"89"}},{"$f":"SUM(O37:P37)","v":{"v":128.960227272727,"d":"129"}}]
["Average Year20","Middle (10-20)",11,20,{"$f":"E37/2+P37+O37/2","v":{"v":156.6730209397335,"d":"157"}},{"$f":"F37/2+E37+P37/2","v":{"v":201.581269152195,"d":"202"}},{"$f":"G37/2+F37+E37/2","v":195.32358912155252},{"$f":"H37/2+G37+F37/2","v":{"v":133.37670454545452,"d":"133"}},{"$f":"I37/2+H37+G37/2","v":{"v":80.728977272727,"d":"81"}},{"$f":"J37/2+I37+H37/2","v":{"v":64.73124999999999,"d":"65"}},{"$f":"K37/2+J37+I37/2","v":{"v":60.757954545454496,"d":"61"}},{"$f":"L37/2+K37+J37/2","v":{"v":54.076704545454504,"d":"54"}},{"$f":"M37/2+L37+K37/2","v":{"v":43.0210227272725,"d":"43"}},{"$f":"N37/2+M37+L37/2","v":{"v":44.2318181818175,"d":"44"}},{"$f":"O37/2+N37+M37/2","v":{"v":70.474431818181,"d":"70"}},{"$f":"P37/2+O37+N37/2","v":{"v":108.98124999999949,"d":"109"}}]
["Average Year30","End (20-31)",21,31,{"$f":"O37+P37","v":{"v":128.960227272727,"d":"129"}},{"$f":"E37+P37","v":{"v":184.38581460673998,"d":"184"}},{"$f":"E37+F37","v":{"v":218.77672369765,"d":"219"}},{"$f":"F37+G37","v":{"v":171.870454545455,"d":"172"}},{"$f":"G37+H37","v":{"v":94.882954545454,"d":"95"}},{"$f":"H37+I37","v":{"v":66.57499999999999,"d":"67"}},{"$f":"I37+J37","v":{"v":62.887499999999996,"d":"63"}},{"$f":"J37+K37","v":{"v":58.628409090909,"d":"59"}},{"$f":"K37+L37","v":{"v":49.525000000000006,"d":"50"}},{"$f":"L37+M37","v":{"v":36.517045454545,"d":"37"}},{"$f":"M37+N37","v":{"v":51.946590909090006,"d":"52"}},{"$f":"N37+O37","v":{"v":89.002272727272,"d":"89"}}]
[]
[]
["Cumulative Rainfall Calcs - Decile 9 year","Month",null,null,"January","February","March","April","May","June","July","August","September","October","November","December"]
[null,"Days per month","Start","End",31,28,31,30,31,30,31,31,30,31,30,31]
[null,"Decile 9 Monthly Rainfall",null,null,{"$f":"'Location & Climate'!C21","v":{"v":197.41,"d":"197"}},{"$f":"'Location & Climate'!D21","v":{"v":240.6,"d":"241"}},{"$f":"'Location & Climate'!E21","v":{"v":160.92,"d":"161"}},{"$f":"'Location & Climate'!F21","v":{"v":88.12,"d":"88"}},{"$f":"'Location & Climate'!G21","v":{"v":79.84,"d":"80"}},{"$f":"'Location & Climate'!H21","v":{"v":65.3,"d":"65"}},{"$f":"'Location & Climate'!I21","v":{"v":76.72,"d":"77"}},{"$f":"'Location & Climate'!J21","v":{"v":49.3,"d":"49"}},{"$f":"'Location & Climate'!K21","v":{"v":43.64,"d":"44"}},{"$f":"'Location & Climate'!L21","v":{"v":77.2,"d":"77"}},{"$f":"'Location & Climate'!M21","v":{"v":117.3,"d":"117"}},{"$f":"'Location & Climate'!N21","v":{"v":151.14,"d":"151"}}]
["Decile 9 Year10","Start (1-10)",1,10,{"$f":"E45+P45","v":{"v":348.54999999999995,"d":"349"}},{"$f":"SUM(E45:F45)","v":{"v":438.01,"d":"438"}},{"$f":"SUM(F45:G45)","v":{"v":401.52,"d":"402"}},{"$f":"SUM(G45:H45)","v":{"v":249.04,"d":"249"}},{"$f":"SUM(H45:I45)","v":{"v":167.96,"d":"168"}},{"$f":"SUM(I45:J45)","v":{"v":145.14,"d":"145"}},{"$f":"SUM(J45:K45)","v":{"v":142.01999999999998,"d":"142"}},{"$f":"SUM(K45:L45)","v":{"v":126.02,"d":"126"}},{"$f":"SUM(L45:M45)","v":{"v":92.94,"d":"93"}},{"$f":"SUM(M45:N45)","v":{"v":120.84,"d":"121"}},{"$f":"SUM(N45:O45)","v":{"v":194.5,"d":"195"}},{"$f":"SUM(O45:P45)","v":{"v":268.44,"d":"268"}}]
["Decile 9 Year20","Middle (10-20)",11,20,{"$f":"E45/2+P45+O45/2","v":{"v":308.49499999999995,"d":"308"}},{"$f":"F45/2+E45+P45/2","v":{"v":393.28,"d":"393"}},{"$f":"G45/2+F45+E45/2","v":419.765},{"$f":"H45/2+G45+F45/2","v":{"v":325.28,"d":"325"}},{"$f":"I45/2+H45+G45/2","v":{"v":208.5,"d":"209"}},{"$f":"J45/2+I45+H45/2","v":{"v":156.55,"d":"157"}},{"$f":"K45/2+J45+I45/2","v":{"v":143.57999999999998,"d":"144"}},{"$f":"L45/2+K45+J45/2","v":{"v":134.02,"d":"134"}},{"$f":"M45/2+L45+K45/2","v":{"v":109.48,"d":"109"}},{"$f":"N45/2+M45+L45/2","v":{"v":106.89000000000001,"d":"107"}},{"$f":"O45/2+N45+M45/2","v":{"v":157.67,"d":"158"}},{"$f":"P45/2+O45+N45/2","v":{"v":231.47,"d":"231"}}]
["Decile 9 Year30","End (20-31)",21,31,{"$f":"O45+P45","v":{"v":268.44,"d":"268"}},{"$f":"E45+P45","v":{"v":348.54999999999995,"d":"349"}},{"$f":"E45+F45","v":{"v":438.01,"d":"438"}},{"$f":"F45+G45","v":{"v":401.52,"d":"402"}},{"$f":"G45+H45","v":{"v":249.04,"d":"249"}},{"$f":"H45+I45","v":{"v":167.96,"d":"168"}},{"$f":"I45+J45","v":{"v":145.14,"d":"145"}},{"$f":"J45+K45","v":{"v":142.01999999999998,"d":"142"}},{"$f":"K45+L45","v":{"v":126.02,"d":"126"}},{"$f":"L45+M45","v":{"v":92.94,"d":"93"}},{"$f":"M45+N45","v":{"v":120.84,"d":"121"}},{"$f":"N45+O45","v":{"v":194.5,"d":"195"}}]

{"sheet":"Climate Assumptions","index":6,"n_rows":20,"n_cols":26,"rows_kept":20}
["N Order","Netica Name","Model name","Values","Notes",{"$f":"Scenarios!A3&Scenarios!$C3","v":"Scenario 01: 1. Pre-amendment"},{"$f":"Scenarios!A4&Scenarios!$C4","v":"Scenario 02: 2. Rock mulch treatment"},{"$f":"Scenarios!A5&Scenarios!$C5","v":"Scenario 03: 3. Post-amendment"},{"$f":"Scenarios!A6&Scenarios!$C6","v":"Scenario 04: 4. Post-amendment (Reduced treatment depth)"},{"$f":"Scenarios!A7&Scenarios!$C7","v":"Scenario 05: 5. Post-amendment (Reduced treatment ESP)"},{"$f":"Scenarios!A8&Scenarios!$C8","v":"Scenario 06: 6. Post-amendment (Reduced treatment depth and ESP)"},{"$f":"Scenarios!A9&Scenarios!$C9","v":"Scenario 07: -"},{"$f":"Scenarios!A10&Scenarios!$C10","v":"Scenario 08: -"},{"$f":"Scenarios!A11&Scenarios!$C11","v":"Scenario 09: -"},{"$f":"Scenarios!A12&Scenarios!$C12","v":"Scenario 10: -"},{"$f":"Scenarios!A13&Scenarios!$C13","v":"Scenario 11: -"},{"$f":"Scenarios!A14&Scenarios!$C14","v":"Scenario 12: -"},{"$f":"Scenarios!A15&Scenarios!$C15","v":"Scenario 13: -"},{"$f":"Scenarios!A16&Scenarios!$C16","v":"Scenario 14: -"},{"$f":"Scenarios!A17&Scenarios!$C17","v":"Scenario 15: -"},{"$f":"Scenarios!A18&Scenarios!$C18","v":"Scenario 16: -"},{"$f":"Scenarios!A19&Scenarios!$C19","v":"Scenario 17: -"},{"$f":"Scenarios!A20&Scenarios!$C20","v":"Scenario 18: -"},{"$f":"Scenarios!A21&Scenarios!$C21","v":"Scenario 19: -"},{"$f":"Scenarios!A22&Scenarios!$C22","v":"Scenario 20: -"},"Add new columns to left"]
[null,"Climate assumptions"]
[null,null,"Rainfall modelling conditions","Class","User selected","Average Year","Average Year","Average Year","Average Year","Average Year","Average Year","-","-","-","-","-","-","-","-","-","-","-","-","-","-"]
[1,"Avge_annual_rainfall","Average Annual Rainfall","Values","Calculated - no direct model input",{"$f":"SUM(IF(F3='Location & Climate'!$C$14:$E$14,'Location & Climate'!$C$15:$E$15,\" \"))","v":{"v":606.978996424921,"d":"607"}},{"$f":"SUM(IF(G3='Location & Climate'!$C$14:$E$14,'Location & Climate'!$C$15:$E$15,\" \"))","v":{"v":606.978996424921,"d":"607"}},{"$f":"SUM(IF(H3='Location & Climate'!$C$14:$E$14,'Location & Climate'!$C$15:$E$15,\" \"))","v":{"v":606.978996424921,"d":"607"}},{"$f":"SUM(IF(I3='Location & Climate'!$C$14:$E$14,'Location & Climate'!$C$15:$E$15,\" \"))","v":{"v":606.978996424921,"d":"607"}},{"$f":"SUM(IF(J3='Location & Climate'!$C$14:$E$14,'Location & Climate'!$C$15:$E$15,\" \"))","v":{"v":606.978996424921,"d":"607"}},{"$f":"SUM(IF(K3='Location & Climate'!$C$14:$E$14,'Location & Climate'!$C$15:$E$15,\" \"))","v":{"v":606.978996424921,"d":"607"}},"-","-","-","-","-","-","-","-","-","-","-","-","-","-"]
[4,"Rainfall_IFD_index","Probability of > 50mm/hr rainfall","Class","Calculated - no direct model input",{"$f":"IF(F3>0,'Location & Climate'!$C$36,0)","v":"High"},{"$f":"IF(G3>0,'Location & Climate'!$C$36,0)","v":"High"},{"$f":"IF(H3>0,'Location & Climate'!$C$36,0)","v":"High"},{"$f":"IF(I3>0,'Location & Climate'!$C$36,0)","v":"High"},{"$f":"IF(J3>0,'Location & Climate'!$C$36,0)","v":"High"},{"$f":"IF(K3>0,'Location & Climate'!$C$36,0)","v":"High"},"-","-","-","-","-","-","-","-","-","-","-","-","-","-"]
[null,null,"Gypsum Application month","Class","User selected","November","November","November","November","November","November","-","-","-","-","-","-","-","-","-","-","-","-","-","-"]
[null,null,"Day of month","Class","User selected",12,22,1,1,1,1,"-","-","-","-","-","-","-","-","-","-","-","-","-","-"]
[null,null,"Rainfall modelling conditions & Period of Month","Class","Calculated by model",{"$f":"IF(F7<>\"\",IF(F7<=10,F3&\"10\",IF(F7<=20,F3&20,F3&\"30\")),\"\")","v":"Average Year20"},{"$f":"IF(G7<>\"\",IF(G7<=10,G3&\"10\",IF(G7<=20,G3&20,G3&\"30\")),\"\")","v":"Average Year30"},"Average Year10","Average Year10","Average Year10","Average Year10","-","-","-","-","-","-","-","-","-","-","-","-","-","-"]
["2,3","CumulativeRainfall_2month","Cumulative rainfall 2months following gypsum application","Values","Calculated - no direct model input",{"$f":"_xlfn.IFNA(INDEX('Cum RF Calcs'!$A$2:$P$23,MATCH('Climate Assumptions'!F8,'Cum RF Calcs'!$A$2:$A$23,0),MATCH('Climate Assumptions'!F6,'Cum RF Calcs'!$A$2:$P$2,0)),0)","v":{"v":156.67302093973348,"d":"157"}},{"$f":"_xlfn.IFNA(INDEX('Cum RF Calcs'!$A$2:$P$23,MATCH('Climate Assumptions'!G8,'Cum RF Calcs'!$A$2:$A$23,0),MATCH('Climate Assumptions'!G6,'Cum RF Calcs'!$A$2:$P$2,0)),0)","v":{"v":184.38581460673998,"d":"184"}},{"$f":"_xlfn.IFNA(INDEX('Cum RF Calcs'!$A$2:$P$23,MATCH('Climate Assumptions'!H8,'Cum RF Calcs'!$A$2:$A$23,0),MATCH('Climate Assumptions'!H6,'Cum RF Calcs'!$A$2:$P$2,0)),0)","v":{"v":128.960227272727,"d":"129"}},{"$f":"_xlfn.IFNA(INDEX('Cum RF Calcs'!$A$2:$P$23,MATCH('Climate Assumptions'!I8,'Cum RF Calcs'!$A$2:$A$23,0),MATCH('Climate Assumptions'!I6,'Cum RF Calcs'!$A$2:$P$2,0)),0)","v":{"v":128.960227272727,"d":"129"}},{"$f":"_xlfn.IFNA(INDEX('Cum RF Calcs'!$A$2:$P$23,MATCH('Climate Assumptions'!J8,'Cum RF Calcs'!$A$2:$A$23,0),MATCH('Climate Assumptions'!J6,'Cum RF Calcs'!$A$2:$P$2,0)),0)","v":{"v":128.960227272727,"d":"129"}},{"$f":"_xlfn.IFNA(INDEX('Cum RF Calcs'!$A$2:$P$23,MATCH('Climate Assumptions'!K8,'Cum RF Calcs'!$A$2:$A$23,0),MATCH('Climate Assumptions'!K6,'Cum RF Calcs'!$A$2:$P$2,0)),0)","v":{"v":128.960227272727,"d":"129"}},"-","-","-","-","-","-","-","-","-","-","-","-","-","-"]
{"$rows_empty":9}
[{"$nulls":24},""]
[{"$nulls":24},""]

{"sheet":"Interventions","index":7,"n_rows":40,"n_cols":26,"rows_kept":40}
["N Order","Netica Name","Model name","Values","Notes",{"$f":"Scenarios!A3&Scenarios!$C3","v":"Scenario 01: 1. Pre-amendment"},{"$f":"Scenarios!A4&Scenarios!$C4","v":"Scenario 02: 2. Rock mulch treatment"},{"$f":"Scenarios!A5&Scenarios!$C5","v":"Scenario 03: 3. Post-amendment"},{"$f":"Scenarios!A6&Scenarios!$C6","v":"Scenario 04: 4. Post-amendment (Reduced treatment depth)"},{"$f":"Scenarios!A7&Scenarios!$C7","v":"Scenario 05: 5. Post-amendment (Reduced treatment ESP)"},{"$f":"Scenarios!A8&Scenarios!$C8","v":"Scenario 06: 6. Post-amendment (Reduced treatment depth and ESP)"},{"$f":"Scenarios!A9&Scenarios!$C9","v":"Scenario 07: -"},{"$f":"Scenarios!A10&Scenarios!$C10","v":"Scenario 08: -"},{"$f":"Scenarios!A11&Scenarios!$C11","v":"Scenario 09: -"},{"$f":"Scenarios!A12&Scenarios!$C12","v":"Scenario 10: -"},{"$f":"Scenarios!A13&Scenarios!$C13","v":"Scenario 11: -"},{"$f":"Scenarios!A14&Scenarios!$C14","v":"Scenario 12: -"},{"$f":"Scenarios!A15&Scenarios!$C15","v":"Scenario 13: -"},{"$f":"Scenarios!A16&Scenarios!$C16","v":"Scenario 14: -"},{"$f":"Scenarios!A17&Scenarios!$C17","v":"Scenario 15: -"},{"$f":"Scenarios!A18&Scenarios!$C18","v":"Scenario 16: -"},{"$f":"Scenarios!A19&Scenarios!$C19","v":"Scenario 17: -"},{"$f":"Scenarios!A20&Scenarios!$C20","v":"Scenario 18: -"},{"$f":"Scenarios!A21&Scenarios!$C21","v":"Scenario 19: -"},{"$f":"Scenarios!A22&Scenarios!$C22","v":"Scenario 20: -"},"Add new columns to left"]
[null,"Ammendment rate for each soil layer"]
[11,"Spoil_amendment_rate_1","Spoil amendment rate Layer 1","Class","-","Nil","Nil","As_Recommended","As_Recommended","Half_recommended","Half_recommended","-","-","-","-","-","-","-","-","-","-","-","-","-","-"]
[12,"Spoil_amendment_rate_2","Spoil amendment rate Layer 2","Class","-","Nil","Nil","As_Recommended","As_Recommended","Half_recommended","Half_recommended","-","-","-","-","-","-","-","-","-","-","-","-","-","-"]
[13,"Spoil_amendment_rate_3","Spoil amendment rate Layer 3","Class","-","Nil","Nil","As_Recommended","As_Recommended","Half_recommended","Half_recommended","-","-","-","-","-","-","-","-","-","-","-","-","-","-"]
[null,"Ammendment type for each soil layer"]
[14,"Spoil_amendment_type_1","Spoil amendment type Layer 1","Class","-","-","Gypsum","Gypsum","Gypsum","Gypsum","Gypsum","-","-","-","-","-","-","-","-","-","-","-","-","-","-"]
[15,"Spoil_amendment_type_2","Spoil amendment type Layer 2","Class","-","-","Gypsum","Gypsum","Gypsum","Gypsum","Gypsum","-","-","-","-","-","-","-","-","-","-","-","-","-","-"]
[16,"Spoil_amendment_type_3","Spoil amendment type Layer 3","Class","-","-","Gypsum","Gypsum","Gypsum","Gypsum","Gypsum","-","-","-","-","-","-","-","-","-","-","-","-","-","-"]
[null,"Ammendment form for each soil layer"]
[1,"Amendment_form_1","Amendment form Layer 1","Class","-","-","Granular","Granular","Granular","Granular","Granular","-","-","-","-","-","-","-","-","-","-","-","-","-","-"]
[2,"Amendment_form_2","Amendment form Layer 2","Class","-","-","Granular","Granular","Granular","Granular","Granular","-","-","-","-","-","-","-","-","-","-","-","-","-","-"]
[3,"Amendment_form_3","Amendment form Layer 3","Class","-","-","Granular","Granular","Granular","Granular","Granular","-","-","-","-","-","-","-","-","-","-","-","-","-","-"]
[null,"Ammendment application method"]
[26,"Spoil_amendment_application_1","Topsoil amendment application method","Class","-","-","Incorporated","Incorporated","Incorporated","Incorporated","Incorporated","-","-","-","-","-","-","-","-","-","-","-","-","-","-"]
[null,"Contour banks"]
[19,"Contourbank_height","Contourbank height (mm)","Value","-",500,0,500,500,500,500,"-","-","-","-","-","-","-","-","-","-","-","-","-","-"]
[25,"Contourbank_Interval","Contourbank Interval (m)","Value","-",20,20,20,20,20,20,"-","-","-","-","-","-","-","-","-","-","-","-","-","-"]
[4,"Contourbank_permanence","Contourbank permanence","Class","-","Temporary","Temporary","Temporary","Temporary","Temporary","Temporary","-","-","-","-","-","-","-","-","-","-","-","-","-","-"]
[17,"UpslopeBund","Upslope bund","Class","-","Yes","Yes","Yes","Yes","Yes","Yes","-","-","-","-","-","-","-","-","-","-","-","-","-","-"]
[null,"Landform"]
[23,"Slope_angle","Slope angle (%)","Value","-",10,10,10,10,10,10,"-","-","-","-","-","-","-","-","-","-","-","-","-","-"]
[21,"Overall_Slope_length","Overall slope length (m)","Value","-",100,100,100,100,100,100,"-","-","-","-","-","-","-","-","-","-","-","-","-","-"]
[10,"Slope_shape","Slope shape","Class","-","Linear","Linear","Linear","Linear","Linear","Linear","-","-","-","-","-","-","-","-","-","-","-","-","-","-"]
[5,"Lateral_landform_uniformity","Lateral landform uniformity","Class","-","Flat_linear","Flat_linear","Flat_linear","Flat_linear","Flat_linear","Flat_linear","-","-","-","-","-","-","-","-","-","-","-","-","-","-"]
[9,"Slope_Drainage_Type","Slope drainage type","Class","-","Grassed_drains","No_drainage","Grassed_drains","Grassed_drains","Grassed_drains","Grassed_drains","-","-","-","-","-","-","-","-","-","-","-","-","-","-"]
[null,"Ripping"]
[22,"Rip_depth","Rip depth (cm)","Class","-",50,50,50,50,50,50,"-","-","-","-","-","-","-","-","-","-","-","-","-","-"]
[8,"Rip_direction","Rip direction","Class","-","Grade_ripped_downslope","Contour_ripped","Grade_ripped_downslope","Grade_ripped_downslope","Grade_ripped_downslope","Grade_ripped_downslope","-","-","-","-","-","-","-","-","-","-","-","-","-","-"]
[7,"Rip_conditions","Soil moisture at time of ripping","Class","-","Moist","Dry","Moist","Moist","Moist","Moist","-","-","-","-","-","-","-","-","-","-","-","-","-","-"]
[null,"Surface armouring "]
[6,"Mixing_topsoil_rockmulch","Rockmulch applied","Class","-","No","Yes","No","No","No","No","-","-","-","-","-","-","-","-","-","-","-","-","-","-"]
[24,"Surface_armouring_quantity","Surface armouring depth (cm)","Value","-",0,100,0,0,0,0,"-","-","-","-","-","-","-","-","-","-","-","-","-","-"]
[30,"Surface_roughness_noVeg","Soil surface roughness (clod/rock size) (cm)","Value","Calculated by model.  Optional input",5,50,10,10,10,10,"-","-","-","-","-","-","-","-","-","-","-","-","-","-"]
[null,"Vegetation management"]
[28,"ERA_landuse_designation","EA Landuse requirement","Class","-","Native_vegetation","Grazing","Native_vegetation","Native_vegetation","Native_vegetation","Native_vegetation","-","-","-","-","-","-","-","-","-","-","-","-","-","-"]
[29,"Seed_Addition","Seed mix applied","Class","-","None","Mixed_Pasture_Covercrop_Spp","Mixed_Pasture_Covercrop_Spp","Mixed_Pasture_Covercrop_Spp","Mixed_Pasture_Covercrop_Spp","Mixed_Pasture_Covercrop_Spp","-","-","-","-","-","-","-","-","-","-","-","-","-","-"]
[27,"Fertiliser_addition","Topsoil fertiliser addition","Class","-","No","Yes","Yes","Yes","Yes","Yes","-","-","-","-","-","-","-","-","-","-","-","-","-","-"]
[20,"Organic_mulch","Organic mulch thickness (cm)","Value","-",null,0,5,5,5,5,"-","-","-","-","-","-","-","-","-","-","-","-","-","-"]
[18,"Irrigation","Irrigation","Class","-","No","No","Yes","Yes","Yes","Yes","-","-","-","-","-","-","-","-","-","-","-","-","-","-"]

{"sheet":"Soil Chemical","index":8,"n_rows":21,"n_cols":26,"rows_kept":21}
["N Order","Netica Name","Model name","Values","Notes",{"$f":"Scenarios!A3&Scenarios!$C3","v":"Scenario 01: 1. Pre-amendment"},{"$f":"Scenarios!A4&Scenarios!$C4","v":"Scenario 02: 2. Rock mulch treatment"},{"$f":"Scenarios!A5&Scenarios!$C5","v":"Scenario 03: 3. Post-amendment"},{"$f":"Scenarios!A6&Scenarios!$C6","v":"Scenario 04: 4. Post-amendment (Reduced treatment depth)"},{"$f":"Scenarios!A7&Scenarios!$C7","v":"Scenario 05: 5. Post-amendment (Reduced treatment ESP)"},{"$f":"Scenarios!A8&Scenarios!$C8","v":"Scenario 06: 6. Post-amendment (Reduced treatment depth and ESP)"},{"$f":"Scenarios!A9&Scenarios!$C9","v":"Scenario 07: -"},{"$f":"Scenarios!A10&Scenarios!$C10","v":"Scenario 08: -"},{"$f":"Scenarios!A11&Scenarios!$C11","v":"Scenario 09: -"},{"$f":"Scenarios!A12&Scenarios!$C12","v":"Scenario 10: -"},{"$f":"Scenarios!A13&Scenarios!$C13","v":"Scenario 11: -"},{"$f":"Scenarios!A14&Scenarios!$C14","v":"Scenario 12: -"},{"$f":"Scenarios!A15&Scenarios!$C15","v":"Scenario 13: -"},{"$f":"Scenarios!A16&Scenarios!$C16","v":"Scenario 14: -"},{"$f":"Scenarios!A17&Scenarios!$C17","v":"Scenario 15: -"},{"$f":"Scenarios!A18&Scenarios!$C18","v":"Scenario 16: -"},{"$f":"Scenarios!A19&Scenarios!$C19","v":"Scenario 17: -"},{"$f":"Scenarios!A20&Scenarios!$C20","v":"Scenario 18: -"},{"$f":"Scenarios!A21&Scenarios!$C21","v":"Scenario 19: -"},{"$f":"Scenarios!A22&Scenarios!$C22","v":"Scenario 20: -"},"Add new columns to left"]
[null,"pH"]
[10,"pH_1","pH (water) Layer 1","Value","-",5.7,5.7,5.7,5.7,5.7,5.7,"-","-","-","-","-","-","-","-","-","-","-","-","-","-"]
[11,"pH_2","pH (water) Layer 2","Value","-",5.7,5.7,5.7,5.7,5.7,5.7,"-","-","-","-","-","-","-","-","-","-","-","-","-","-"]
[12,"pH_3","pH (water) Layer 3","Value","--","-","-","-","-","-","-","-","-","-","-","-","-","-","-","-","-","-","-","-","-"]
[null,"EC (1:5)"]
[1,"EC_1","EC (1:5) Layer 1 (dS/m)","Value","-",{"v":0.7,"d":"0.70"},0.28,0.28,0.28,0.28,0.28,"-","-","-","-","-","-","-","-","-","-","-","-","-","-"]
[2,"EC_2","EC (1:5) Layer 2 (dS/m)","Value","-",{"v":0.7,"d":"0.70"},0.34,0.34,0.34,0.34,0.34,"-","-","-","-","-","-","-","-","-","-","-","-","-","-"]
[3,"EC_3","EC (1:5) Layer 3 (dS/m)","Value","-",{"v":0.7,"d":"0.70"},0.34,0.34,0.34,0.34,0.34,"-","-","-","-","-","-","-","-","-","-","-","-","-","-"]
[null,"Cations (Sodium)"]
[7,"Na_ex_1","Exchangeable Sodium Layer 1 (meq/100g)","Value","-",{"v":5,"d":"5.00"},{"v":0.3936605316973415,"d":"0.39"},{"v":0.3936605316973415,"d":"0.39"},{"v":0.3936605316973415,"d":"0.39"},{"v":2,"d":"2.00"},{"v":2,"d":"2.00"},"-","-","-","-","-","-","-","-","-","-","-","-","-","-"]
[8,"Na_ex_2","Exchangeable Sodium Layer 2 (meq/100g)","Value","-",{"v":5,"d":"5.00"},{"v":0.8650793650793652,"d":"0.87"},{"v":0.8650793650793652,"d":"0.87"},{"v":0.8650793650793652,"d":"0.87"},{"v":2,"d":"2.00"},{"v":2,"d":"2.00"},"-","-","-","-","-","-","-","-","-","-","-","-","-","-"]
[9,"Na_ex_3","Exchangeable Sodium Layer 3 (meq/100g)","Value","-",{"v":5,"d":"5.00"},{"v":0.8650793650793652,"d":"0.87"},{"v":0.8650793650793652,"d":"0.87"},{"v":0.8650793650793652,"d":"0.87"},{"v":2,"d":"2.00"},{"v":2,"d":"2.00"},"-","-","-","-","-","-","-","-","-","-","-","-","-","-"]
[null,"Cations (Potassium)"]
[4,"K_ex_1","Exchangeable Potassium Layer 1 (meq/100g)","Value","-",{"v":0.3,"d":"0.30"},0.64,0.64,0.64,0.64,0.64,"-","-","-","-","-","-","-","-","-","-","-","-","-","-"]
[5,"K_ex_2","Exchangeable Potassium Layer 2 (meq/100g)","Value","-",{"v":0.3,"d":"0.30"},{"v":0.5,"d":"0.50"},{"v":0.5,"d":"0.50"},{"v":0.5,"d":"0.50"},{"v":0.5,"d":"0.50"},{"v":0.5,"d":"0.50"},"-","-","-","-","-","-","-","-","-","-","-","-","-","-"]
[6,"K_ex_3","Exchangeable Potassium Layer 3 (meq/100g)","Value","-",{"v":0.3,"d":"0.30"},{"v":0.5,"d":"0.50"},{"v":0.5,"d":"0.50"},{"v":0.5,"d":"0.50"},{"v":0.5,"d":"0.50"},{"v":0.5,"d":"0.50"},"-","-","-","-","-","-","-","-","-","-","-","-","-","-"]
[null,"Exchangeable dispersion percentage"]
[13,"EDP_1","Exchangeable dispersive percentage Layer 1 (%)","Calculated by model","Model asks for input, but should be calcuated",35.8,3,3,3,15,15,"-","-","-","-","-","-","-","-","-","-","-","-","-","-"]
[14,"EDP_2","Exchangeable dispersive percentage Layer 2 (%)","Calculated by model","Model asks for input, but should be calcuated",35.8,6,6,6,15,15,"-","-","-","-","-","-","-","-","-","-","-","-","-","-"]
[15,"EDP_3","Exchangeable dispersive percentage Layer 3 (%)","Calculated by model","Model asks for input, but should be calcuated",35.8,6,6,6,15,15,"-","-","-","-","-","-","-","-","-","-","-","-","-","-"]

{"sheet":"Soil physical","index":9,"n_rows":16,"n_cols":26,"rows_kept":16}
["N Order","Netica Name","Model name","Values","Notes",{"$f":"Scenarios!A3&Scenarios!$C3","v":"Scenario 01: 1. Pre-amendment"},{"$f":"Scenarios!A4&Scenarios!$C4","v":"Scenario 02: 2. Rock mulch treatment"},{"$f":"Scenarios!A5&Scenarios!$C5","v":"Scenario 03: 3. Post-amendment"},{"$f":"Scenarios!A6&Scenarios!$C6","v":"Scenario 04: 4. Post-amendment (Reduced treatment depth)"},{"$f":"Scenarios!A7&Scenarios!$C7","v":"Scenario 05: 5. Post-amendment (Reduced treatment ESP)"},{"$f":"Scenarios!A8&Scenarios!$C8","v":"Scenario 06: 6. Post-amendment (Reduced treatment depth and ESP)"},{"$f":"Scenarios!A9&Scenarios!$C9","v":"Scenario 07: -"},{"$f":"Scenarios!A10&Scenarios!$C10","v":"Scenario 08: -"},{"$f":"Scenarios!A11&Scenarios!$C11","v":"Scenario 09: -"},{"$f":"Scenarios!A12&Scenarios!$C12","v":"Scenario 10: -"},{"$f":"Scenarios!A13&Scenarios!$C13","v":"Scenario 11: -"},{"$f":"Scenarios!A14&Scenarios!$C14","v":"Scenario 12: -"},{"$f":"Scenarios!A15&Scenarios!$C15","v":"Scenario 13: -"},{"$f":"Scenarios!A16&Scenarios!$C16","v":"Scenario 14: -"},{"$f":"Scenarios!A17&Scenarios!$C17","v":"Scenario 15: -"},{"$f":"Scenarios!A18&Scenarios!$C18","v":"Scenario 16: -"},{"$f":"Scenarios!A19&Scenarios!$C19","v":"Scenario 17: -"},{"$f":"Scenarios!A20&Scenarios!$C20","v":"Scenario 18: -"},{"$f":"Scenarios!A21&Scenarios!$C21","v":"Scenario 19: -"},{"$f":"Scenarios!A22&Scenarios!$C22","v":"Scenario 20: -"},"Add new columns to left"]
[null,"Clay"]
[3,"Clay_1","Clay proportion Layer 1 (%)","Value","-",35.5,{"v":9.75,"d":"9.8"},35.5,35.5,35.5,35.5,"-","-","-","-","-","-","-","-","-","-","-","-","-","-"]
[4,"Clay_2","Clay proportion Layer 2 (%)","Value","-",35.5,{"v":8.25,"d":"8.3"},35.5,35.5,35.5,35.5,"-","-","-","-","-","-","-","-","-","-","-","-","-","-"]
[null,"Sand"]
[7,"Sand_1","Sand proportion Layer 1 (%)","Value","-",{"v":35,"d":"35.0"},{"v":56.75,"d":"56.8"},{"v":35,"d":"35.0"},{"v":35,"d":"35.0"},{"v":35,"d":"35.0"},{"v":35,"d":"35.0"},"-","-","-","-","-","-","-","-","-","-","-","-","-","-"]
[8,"Sand_2","Sand proportion Layer 2 (%)","Value","-",{"v":35,"d":"35.0"},{"v":59,"d":"59.0"},{"v":35,"d":"35.0"},{"v":35,"d":"35.0"},{"v":35,"d":"35.0"},{"v":35,"d":"35.0"},"-","-","-","-","-","-","-","-","-","-","-","-","-","-"]
[null,"Stone"]
[9,"Stone_content_1","Stone proportion Layer 1 (%)","Value","-","-","-","-","-","-","-","-","-","-","-","-","-","-","-","-","-","-","-","-","-"]
[10,"Stone_content_2","Stone proportion Layer 2 (%)","Value","-","-","-","-","-","-","-","-","-","-","-","-","-","-","-","-","-","-","-","-","-"]
[null,"Bulk density"]
[1,"Bulk_density_1","Bulk Density Layer 1 (ton/m3)","Value","-",{"v":1.5,"d":"1.50"},{"v":1.4275,"d":"1.43"},{"v":1.5,"d":"1.50"},{"v":1.5,"d":"1.50"},{"v":1.5,"d":"1.50"},{"v":1.5,"d":"1.50"},"-","-","-","-","-","-","-","-","-","-","-","-","-","-"]
[2,"Bulk_density_2","Bulk Density Layer 2 (ton/m3)","Value","-",{"v":1.5,"d":"1.50"},1.45,{"v":1.5,"d":"1.50"},{"v":1.5,"d":"1.50"},{"v":1.5,"d":"1.50"},{"v":1.5,"d":"1.50"},"-","-","-","-","-","-","-","-","-","-","-","-","-","-"]
[null,"Soil depth"]
[5,"Depth_to_L2","Depth of Layer 1 (Topsoil) (cm)","Value","-",10,50,20,10,20,10,"-","-","-","-","-","-","-","-","-","-","-","-","-","-"]
[6,"Depth_to_L3","Depth of Layer 2 (Subsoil) (cm)","Value","-",50,50,35,20,35,20,"-","-","-","-","-","-","-","-","-","-","-","-","-","-"]

{"sheet":"Vegetation","index":10,"n_rows":9,"n_cols":26,"rows_kept":9}
["N Order","Netica Name","Model name","Values","Notes",{"$f":"Scenarios!A3&Scenarios!$C3","v":"Scenario 01: 1. Pre-amendment"},{"$f":"Scenarios!A4&Scenarios!$C4","v":"Scenario 02: 2. Rock mulch treatment"},{"$f":"Scenarios!A5&Scenarios!$C5","v":"Scenario 03: 3. Post-amendment"},{"$f":"Scenarios!A6&Scenarios!$C6","v":"Scenario 04: 4. Post-amendment (Reduced treatment depth)"},{"$f":"Scenarios!A7&Scenarios!$C7","v":"Scenario 05: 5. Post-amendment (Reduced treatment ESP)"},{"$f":"Scenarios!A8&Scenarios!$C8","v":"Scenario 06: 6. Post-amendment (Reduced treatment depth and ESP)"},{"$f":"Scenarios!A9&Scenarios!$C9","v":"Scenario 07: -"},{"$f":"Scenarios!A10&Scenarios!$C10","v":"Scenario 08: -"},{"$f":"Scenarios!A11&Scenarios!$C11","v":"Scenario 09: -"},{"$f":"Scenarios!A12&Scenarios!$C12","v":"Scenario 10: -"},{"$f":"Scenarios!A13&Scenarios!$C13","v":"Scenario 11: -"},{"$f":"Scenarios!A14&Scenarios!$C14","v":"Scenario 12: -"},{"$f":"Scenarios!A15&Scenarios!$C15","v":"Scenario 13: -"},{"$f":"Scenarios!A16&Scenarios!$C16","v":"Scenario 14: -"},{"$f":"Scenarios!A17&Scenarios!$C17","v":"Scenario 15: -"},{"$f":"Scenarios!A18&Scenarios!$C18","v":"Scenario 16: -"},{"$f":"Scenarios!A19&Scenarios!$C19","v":"Scenario 17: -"},{"$f":"Scenarios!A20&Scenarios!$C20","v":"Scenario 18: -"},{"$f":"Scenarios!A21&Scenarios!$C21","v":"Scenario 19: -"},{"$f":"Scenarios!A22&Scenarios!$C22","v":"Scenario 20: -"},"Add new columns to left"]
[null,"Soil condition"]
[1,"Soil_Nutrient_Status","Topsoil nutrient status","Class","-","Low","Moderate","High","High","High","High","-","-","-","-","-","-","-","-","-","-","-","-","-","-"]
[2,"Topsoil_organic_matter","Topsoil organic matter","Class","Calculated by model.  Optional input","Low","Low","Medium","High","High","High","-","-","-","-","-","-","-","-","-","-","-","-","-","-"]
[null,"Vegetation cover"]
[3,"Annual_spp_groundcover","Annual species cover (%)","Value","Calculated by model.  Optional input",0,0,79,79,79,79,{"$f":"D10","v":0},"-","-","-","-","-","-","-","-","-","-","-","-","-"]
[4,"Perennial_spp_groundcover","Perennial species cover (%)","Value","Calculated by model.  Optional input",0,{"v":42.54752051920926,"d":"43"},79,79,79,79,"-","-","-","-","-","-","-","-","-","-","-","-","-","-"]
[6,"Woody_spp_cover","Woody species cover (%)","Value","Calculated by model.  Optional input",0,0,0,0,0,0,"-","-","-","-","-","-","-","-","-","-","-","-","-","-"]
[5,"Vegetation_cover","Total vegetation cover (%)","Value","Calculated by model.  Optional input",0,{"v":42.54752051920926,"d":"43"},79,79,79,79,"-","-","-","-","-","-","-","-","-","-","-","-","-","-"]

{"sheet":"Lists","index":11,"n_rows":138,"n_cols":4,"rows_kept":138}
["Netica Name","Model name","Values"]
["Climate variables"]
["CumulativeRainfall_2month","Gypsum_Application_Month","January"]
[null,null,"February"]
[null,null,"March"]
[null,null,"April"]
[null,null,"May"]
[null,null,"June"]
[null,null,"July"]
[null,null,"August"]
[null,null,"September"]
[null,null,"October"]
[null,null,"November"]
[null,null,"December"]
[null,null,"-"]
["CumulativeRainfall_2month","Day_of_Month",1]
[null,null,2]
[null,null,3]
[null,null,4]
[null,null,5]
[null,null,6]
[null,null,7]
[null,null,8]
[null,null,9]
[null,null,10]
[null,null,11]
[null,null,12]
[null,null,13]
[null,null,14]
[null,null,15]
[null,null,16]
[null,null,17]
[null,null,18]
[null,null,19]
[null,null,20]
[null,null,21]
[null,null,22]
[null,null,23]
[null,null,24]
[null,null,25]
[null,null,26]
[null,null,27]
[null,null,28]
[null,null,29]
[null,null,30]
[null,null,31]
[null,null,"-"]
["CumulativeRainfall_2month","Rainfall_modelling_conditions","Decile 1 Year"]
[null,null,"Average Year"]
[null,null,"Decile 9 Year"]
[null,null,"-"]
["Ammendments"]
["Spoil_amendment_rate","Spoil_amendment_rate","Nil"]
[null,null,"Half_recommended"]
[null,null,"Three_quarters_recommended"]
[null,null,"As_Recommended"]
[null,null,"-"]
["Spoil_amendment_type","Spoil_amendment_type","Gypsum"]
[null,null,"Lime"]
[null,null,"-"]
["Amendment_form","Amendment_form","Micronised"]
[null,null,"Powder"]
[null,null,"Granular"]
[null,null,"-"]
["Spoil_amendment_application_1","Topsoil_amendment_application_method","Spread"]
[null,null,"Incorporated"]
[null,null,"-"]
["Contour banks"]
["Contourbank_permanence","Contourbank_permanence","Permanent_maintained"]
[null,null,"Permanent_not_maintained"]
[null,null,"Temporary"]
[null,null,"Not_constructed"]
[null,null,"-"]
["UpslopeBund","Upslope_bund","Yes"]
[null,null,"No"]
[null,null,"-"]
["Landform"]
["Slope_shape","Slope_shape","Linear"]
[null,null,"Concave"]
[null,null,"Convex"]
[null,null,"Complex_geomorphic"]
[null,null,"-"]
["Lateral_landform_uniformity","Lateral_landform_uniformity","Flat_linear"]
[null,null,"Converging"]
[null,null,"Diverging"]
[null,null,"-"]
["SlopeDrainage","Slope_drainage_structures","No_drainage"]
[null,null,"Grassed_drains"]
[null,null,"Rock_drains"]
[null,null,"-"]
["Ripping"]
["Rip_direction","Rip_direction","Not_ripped"]
[null,null,"Contour_ripped"]
[null,null,"Grade_ripped_downslope"]
[null,null,"-"]
["Rip_conditions","Soil_moisture_at_time_of_ripping","Dry"]
[null,null,"Moist"]
[null,null,"-"]
["Surface armouring "]
["Mixing_topsoil_rockmulch","Rockmulch_applied","Yes"]
[null,null,"No"]
[null,null,"-"]
["Vegetation management"]
["ERA_landuse_designation","EA_Landuse_requirement","Grazing"]
[null,null,"Native_vegetation"]
[null,null,"-"]
["Seed_Addition","Seed_mix_applied","None"]
[null,null,"Native_Woodland_Spp"]
[null,null,"Mixed_Woodland_Spp_Covercrop"]
[null,null,"Perennial_Pasture_Spp"]
[null,null,"Mixed_Pasture_Covercrop_Spp"]
[null,null,"-"]
["Fertiliser_addition","Topsoil_fertiliser_addition","Yes"]
[null,null,"No"]
[null,null,"-"]
["Irrigation","Irrigation","Yes"]
[null,null,"No"]
[null,null,"-"]
["Soil condition"]
["Soil_Nutrient_Status","Topsoil_nutrient_status","Low"]
[null,null,"Moderate"]
[null,null,"High"]
[null,null,"-"]
["Topsoil_organic_matter","Topsoil_organic_carbon","Very low"]
[null,null,"Low"]
[null,null,"Medium"]
[null,null,"High"]
[null,null,"-"]
[]
[]
["Results ranges"]
["Output component","Output row","No of output rows ","Formula"]
["PROFILE VULNERABILITY",{"$f":"MATCH(A133,Results!A:A,0)","v":151},{"$f":"MATCH(TRUE,INDEX(INDIRECT(_xlfn.CONCAT(\"Results!B\",B133+1,\":B1000\"))=\"\",0),0)-1","v":6},{"$f":"_xlfn.CONCAT(\"Results!A\",B133+1,\":A\",B133+C133)","v":"Results!A152:A157"}]
["TUNNEL EXPOSURE",{"$f":"MATCH(A134,Results!A:A,0)","v":160},{"$f":"MATCH(TRUE,INDEX(INDIRECT(_xlfn.CONCAT(\"Results!B\",B134+1,\":B1000\"))=\"\",0),0)-1","v":4},{"$f":"_xlfn.CONCAT(\"Results!A\",B134+1,\":A\",B134+C134)","v":"Results!A161:A164"}]
["TUNNELLING RISK",{"$f":"MATCH(A135,Results!A:A,0)","v":165},{"$f":"MATCH(TRUE,INDEX(INDIRECT(_xlfn.CONCAT(\"Results!B\",B135+1,\":B1000\"))=\"\",0),0)-1","v":6},{"$f":"_xlfn.CONCAT(\"Results!A\",B135+1,\":A\",B135+C135)","v":"Results!A166:A171"}]
["LAYER 1 VULNERABILITY",{"$f":"MATCH(A136,Results!A:A,0)","v":96},{"$f":"MATCH(TRUE,INDEX(INDIRECT(_xlfn.CONCAT(\"Results!B\",B136+1,\":B1000\"))=\"\",0),0)-1","v":4},{"$f":"_xlfn.CONCAT(\"Results!A\",B136+1,\":A\",B136+C136)","v":"Results!A97:A100"}]
["SURFACE GULLYING EXPOSURE",{"$f":"MATCH(A137,Results!A:A,0)","v":205},{"$f":"MATCH(TRUE,INDEX(INDIRECT(_xlfn.CONCAT(\"Results!B\",B137+1,\":B1000\"))=\"\",0),0)-1","v":4},"Results!A206:A209"]
["SURFACE EROSION RISK",{"$f":"MATCH(A138,Results!A:A,0)","v":210},{"$f":"MATCH(TRUE,INDEX(INDIRECT(_xlfn.CONCAT(\"Results!B\",B138+1,\":B1000\"))=\"\",0),0)-1","v":6},"Results!A211:A216"]

{"sheet":"Scenarios Combined","index":12,"n_rows":92,"n_cols":26,"rows_kept":92}
["N Order","Netica Name","Model name","Values","Notes",{"$f":"Scenarios!A3&Scenarios!$C3","v":"Scenario 01: 1. Pre-amendment"},{"$f":"Scenarios!A4&Scenarios!$C4","v":"Scenario 02: 2. Rock mulch treatment"},{"$f":"Scenarios!A5&Scenarios!$C5","v":"Scenario 03: 3. Post-amendment"},{"$f":"Scenarios!A6&Scenarios!$C6","v":"Scenario 04: 4. Post-amendment (Reduced treatment depth)"},{"$f":"Scenarios!A7&Scenarios!$C7","v":"Scenario 05: 5. Post-amendment (Reduced treatment ESP)"},{"$f":"Scenarios!A8&Scenarios!$C8","v":"Scenario 06: 6. Post-amendment (Reduced treatment depth and ESP)"},{"$f":"Scenarios!A9&Scenarios!$C9","v":"Scenario 07: -"},{"$f":"Scenarios!A10&Scenarios!$C10","v":"Scenario 08: -"},{"$f":"Scenarios!A11&Scenarios!$C11","v":"Scenario 09: -"},{"$f":"Scenarios!A12&Scenarios!$C12","v":"Scenario 10: -"},{"$f":"Scenarios!A13&Scenarios!$C13","v":"Scenario 11: -"},{"$f":"Scenarios!A14&Scenarios!$C14","v":"Scenario 12: -"},{"$f":"Scenarios!A15&Scenarios!$C15","v":"Scenario 13: -"},{"$f":"Scenarios!A16&Scenarios!$C16","v":"Scenario 14: -"},{"$f":"Scenarios!A17&Scenarios!$C17","v":"Scenario 15: -"},{"$f":"Scenarios!A18&Scenarios!$C18","v":"Scenario 16: -"},{"$f":"Scenarios!A19&Scenarios!$C19","v":"Scenario 17: -"},{"$f":"Scenarios!A20&Scenarios!$C20","v":"Scenario 18: -"},{"$f":"Scenarios!A21&Scenarios!$C21","v":"Scenario 19: -"},{"$f":"Scenarios!A22&Scenarios!$C22","v":"Scenario 20: -"},"Add new columns to left"]
[null,"Climate assumptions"]
[{"$f":"'Climate Assumptions'!A2","v":0},{"$f":"'Climate Assumptions'!B2","v":"Climate assumptions"}]
[{"$f":"'Climate Assumptions'!A3","v":0},{"$f":"'Climate Assumptions'!B3","v":0},{"$f":"'Climate Assumptions'!C3","v":"Rainfall modelling conditions"},{"$f":"'Climate Assumptions'!D3","v":"Class"},{"$f":"'Climate Assumptions'!E3","v":"User selected"},{"$f":"'Climate Assumptions'!F3","v":"Average Year"},{"$f":"'Climate Assumptions'!G3","v":"Average Year"},{"$f":"'Climate Assumptions'!H3","v":"Average Year"},{"$f":"'Climate Assumptions'!I3","v":"Average Year"},{"$f":"'Climate Assumptions'!J3","v":"Average Year"},{"$f":"'Climate Assumptions'!K3","v":"Average Year"},{"$f":"'Climate Assumptions'!L3","v":"-"},{"$f":"'Climate Assumptions'!M3","v":"-"},{"$f":"'Climate Assumptions'!N3","v":"-"},{"$f":"'Climate Assumptions'!O3","v":"-"},{"$f":"'Climate Assumptions'!P3","v":"-"},{"$f":"'Climate Assumptions'!Q3","v":"-"},{"$f":"'Climate Assumptions'!R3","v":"-"},{"$f":"'Climate Assumptions'!S3","v":"-"},{"$f":"'Climate Assumptions'!T3","v":"-"},{"$f":"'Climate Assumptions'!U3","v":"-"},{"$f":"'Climate Assumptions'!V3","v":"-"},{"$f":"'Climate Assumptions'!W3","v":"-"},{"$f":"'Climate Assumptions'!X3","v":"-"},{"$f":"'Climate Assumptions'!Y3","v":"-"}]
[{"$f":"'Climate Assumptions'!A4","v":1},{"$f":"'Climate Assumptions'!B4","v":"Avge_annual_rainfall"},{"$f":"'Climate Assumptions'!C4","v":"Average Annual Rainfall"},{"$f":"'Climate Assumptions'!D4","v":"Values"},{"$f":"'Climate Assumptions'!E4","v":"Calculated - no direct model input"},{"$f":"'Climate Assumptions'!F4","v":606.978996424921},{"$f":"'Climate Assumptions'!G4","v":606.978996424921},{"$f":"'Climate Assumptions'!H4","v":606.978996424921},{"$f":"'Climate Assumptions'!I4","v":606.978996424921},{"$f":"'Climate Assumptions'!J4","v":606.978996424921},{"$f":"'Climate Assumptions'!K4","v":606.978996424921},{"$f":"'Climate Assumptions'!L4","v":"-"},{"$f":"'Climate Assumptions'!M4","v":"-"},{"$f":"'Climate Assumptions'!N4","v":"-"},{"$f":"'Climate Assumptions'!O4","v":"-"},{"$f":"'Climate Assumptions'!P4","v":"-"},{"$f":"'Climate Assumptions'!Q4","v":"-"},{"$f":"'Climate Assumptions'!R4","v":"-"},{"$f":"'Climate Assumptions'!S4","v":"-"},{"$f":"'Climate Assumptions'!T4","v":"-"},{"$f":"'Climate Assumptions'!U4","v":"-"},{"$f":"'Climate Assumptions'!V4","v":"-"},{"$f":"'Climate Assumptions'!W4","v":"-"},{"$f":"'Climate Assumptions'!X4","v":"-"},{"$f":"'Climate Assumptions'!Y4","v":"-"}]
[{"$f":"'Climate Assumptions'!A5","v":4},{"$f":"'Climate Assumptions'!B5","v":"Rainfall_IFD_index"},{"$f":"'Climate Assumptions'!C5","v":"Probability of > 50mm/hr rainfall"},{"$f":"'Climate Assumptions'!D5","v":"Class"},{"$f":"'Climate Assumptions'!E5","v":"Calculated - no direct model input"},{"$f":"'Climate Assumptions'!F5","v":"High"},{"$f":"'Climate Assumptions'!G5","v":"High"},{"$f":"'Climate Assumptions'!H5","v":"High"},{"$f":"'Climate Assumptions'!I5","v":"High"},{"$f":"'Climate Assumptions'!J5","v":"High"},{"$f":"'Climate Assumptions'!K5","v":"High"},{"$f":"'Climate Assumptions'!L5","v":"-"},{"$f":"'Climate Assumptions'!M5","v":"-"},{"$f":"'Climate Assumptions'!N5","v":"-"},{"$f":"'Climate Assumptions'!O5","v":"-"},{"$f":"'Climate Assumptions'!P5","v":"-"},{"$f":"'Climate Assumptions'!Q5","v":"-"},{"$f":"'Climate Assumptions'!R5","v":"-"},{"$f":"'Climate Assumptions'!S5","v":"-"},{"$f":"'Climate Assumptions'!T5","v":"-"},{"$f":"'Climate Assumptions'!U5","v":"-"},{"$f":"'Climate Assumptions'!V5","v":"-"},{"$f":"'Climate Assumptions'!W5","v":"-"},{"$f":"'Climate Assumptions'!X5","v":"-"},{"$f":"'Climate Assumptions'!Y5","v":"-"}]
[{"$f":"'Climate Assumptions'!A6","v":0},{"$f":"'Climate Assumptions'!B6","v":0},{"$f":"'Climate Assumptions'!C6","v":"Gypsum Application month"},{"$f":"'Climate Assumptions'!D6","v":"Class"},{"$f":"'Climate Assumptions'!E6","v":"User selected"},{"$f":"'Climate Assumptions'!F6","v":"November"},{"$f":"'Climate Assumptions'!G6","v":"November"},{"$f":"'Climate Assumptions'!H6","v":"November"},{"$f":"'Climate Assumptions'!I6","v":"November"},{"$f":"'Climate Assumptions'!J6","v":"November"},{"$f":"'Climate Assumptions'!K6","v":"November"},{"$f":"'Climate Assumptions'!L6","v":"-"},{"$f":"'Climate Assumptions'!M6","v":"-"},{"$f":"'Climate Assumptions'!N6","v":"-"},{"$f":"'Climate Assumptions'!O6","v":"-"},{"$f":"'Climate Assumptions'!P6","v":"-"},{"$f":"'Climate Assumptions'!Q6","v":"-"},{"$f":"'Climate Assumptions'!R6","v":"-"},{"$f":"'Climate Assumptions'!S6","v":"-"},{"$f":"'Climate Assumptions'!T6","v":"-"},{"$f":"'Climate Assumptions'!U6","v":"-"},{"$f":"'Climate Assumptions'!V6","v":"-"},{"$f":"'Climate Assumptions'!W6","v":"-"},{"$f":"'Climate Assumptions'!X6","v":"-"},{"$f":"'Climate Assumptions'!Y6","v":"-"}]
[{"$f":"'Climate Assumptions'!A7","v":0},{"$f":"'Climate Assumptions'!B7","v":0},{"$f":"'Climate Assumptions'!C7","v":"Day of month"},{"$f":"'Climate Assumptions'!D7","v":"Class"},{"$f":"'Climate Assumptions'!E7","v":"User selected"},{"$f":"'Climate Assumptions'!F7","v":12},{"$f":"'Climate Assumptions'!G7","v":22},{"$f":"'Climate Assumptions'!H7","v":1},{"$f":"'Climate Assumptions'!I7","v":1},{"$f":"'Climate Assumptions'!J7","v":1},{"$f":"'Climate Assumptions'!K7","v":1},{"$f":"'Climate Assumptions'!L7","v":"-"},{"$f":"'Climate Assumptions'!M7","v":"-"},{"$f":"'Climate Assumptions'!N7","v":"-"},{"$f":"'Climate Assumptions'!O7","v":"-"},{"$f":"'Climate Assumptions'!P7","v":"-"},{"$f":"'Climate Assumptions'!Q7","v":"-"},{"$f":"'Climate Assumptions'!R7","v":"-"},{"$f":"'Climate Assumptions'!S7","v":"-"},{"$f":"'Climate Assumptions'!T7","v":"-"},{"$f":"'Climate Assumptions'!U7","v":"-"},{"$f":"'Climate Assumptions'!V7","v":"-"},{"$f":"'Climate Assumptions'!W7","v":"-"},{"$f":"'Climate Assumptions'!X7","v":"-"},{"$f":"'Climate Assumptions'!Y7","v":"-"}]
[{"$f":"'Climate Assumptions'!A9","v":"2,3"},{"$f":"'Climate Assumptions'!B9","v":"CumulativeRainfall_2month"},{"$f":"'Climate Assumptions'!C9","v":"Cumulative rainfall 2months following gypsum application"},{"$f":"'Climate Assumptions'!D9","v":"Values"},{"$f":"'Climate Assumptions'!E9","v":"Calculated - no direct model input"},{"$f":"'Climate Assumptions'!F9","v":156.67302093973348},{"$f":"'Climate Assumptions'!G9","v":184.38581460673998},{"$f":"'Climate Assumptions'!H9","v":128.960227272727},{"$f":"'Climate Assumptions'!I9","v":128.960227272727},{"$f":"'Climate Assumptions'!J9","v":128.960227272727},{"$f":"'Climate Assumptions'!K9","v":128.960227272727},{"$f":"'Climate Assumptions'!L9","v":"-"},{"$f":"'Climate Assumptions'!M9","v":"-"},{"$f":"'Climate Assumptions'!N9","v":"-"},{"$f":"'Climate Assumptions'!O9","v":"-"},{"$f":"'Climate Assumptions'!P9","v":"-"},{"$f":"'Climate Assumptions'!Q9","v":"-"},{"$f":"'Climate Assumptions'!R9","v":"-"},{"$f":"'Climate Assumptions'!S9","v":"-"},{"$f":"'Climate Assumptions'!T9","v":"-"},{"$f":"'Climate Assumptions'!U9","v":"-"},{"$f":"'Climate Assumptions'!V9","v":"-"},{"$f":"'Climate Assumptions'!W9","v":"-"},{"$f":"'Climate Assumptions'!X9","v":"-"},{"$f":"'Climate Assumptions'!Y9","v":"-"}]
[null,"Interventions"]
[{"$f":"Interventions!A2","v":0},{"$f":"Interventions!B2","v":"Ammendment rate for each soil layer"}]
[{"$f":"Interventions!A3","v":11},{"$f":"Interventions!B3","v":"Spoil_amendment_rate_1"},{"$f":"Interventions!C3","v":"Spoil amendment rate Layer 1"},{"$f":"Interventions!D3","v":"Class"},{"$f":"Interventions!E3","v":"-"},{"$f":"Interventions!F3","v":"Nil"},{"$f":"Interventions!G3","v":"Nil"},{"$f":"Interventions!H3","v":"As_Recommended"},{"$f":"Interventions!I3","v":"As_Recommended"},{"$f":"Interventions!J3","v":"Half_recommended"},{"$f":"Interventions!K3","v":"Half_recommended"},{"$f":"Interventions!L3","v":"-"},{"$f":"Interventions!M3","v":"-"},{"$f":"Interventions!N3","v":"-"},{"$f":"Interventions!O3","v":"-"},{"$f":"Interventions!P3","v":"-"},{"$f":"Interventions!Q3","v":"-"},{"$f":"Interventions!R3","v":"-"},{"$f":"Interventions!S3","v":"-"},{"$f":"Interventions!T3","v":"-"},{"$f":"Interventions!U3","v":"-"},{"$f":"Interventions!V3","v":"-"},{"$f":"Interventions!W3","v":"-"},{"$f":"Interventions!X3","v":"-"},{"$f":"Interventions!Y3","v":"-"}]
[{"$f":"Interventions!A4","v":12},{"$f":"Interventions!B4","v":"Spoil_amendment_rate_2"},{"$f":"Interventions!C4","v":"Spoil amendment rate Layer 2"},{"$f":"Interventions!D4","v":"Class"},{"$f":"Interventions!E4","v":"-"},{"$f":"Interventions!F4","v":"Nil"},{"$f":"Interventions!G4","v":"Nil"},{"$f":"Interventions!H4","v":"As_Recommended"},{"$f":"Interventions!I4","v":"As_Recommended"},{"$f":"Interventions!J4","v":"Half_recommended"},{"$f":"Interventions!K4","v":"Half_recommended"},{"$f":"Interventions!L4","v":"-"},{"$f":"Interventions!M4","v":"-"},{"$f":"Interventions!N4","v":"-"},{"$f":"Interventions!O4","v":"-"},{"$f":"Interventions!P4","v":"-"},{"$f":"Interventions!Q4","v":"-"},{"$f":"Interventions!R4","v":"-"},{"$f":"Interventions!S4","v":"-"},{"$f":"Interventions!T4","v":"-"},{"$f":"Interventions!U4","v":"-"},{"$f":"Interventions!V4","v":"-"},{"$f":"Interventions!W4","v":"-"},{"$f":"Interventions!X4","v":"-"},{"$f":"Interventions!Y4","v":"-"}]
[{"$f":"Interventions!A5","v":13},{"$f":"Interventions!B5","v":"Spoil_amendment_rate_3"},{"$f":"Interventions!C5","v":"Spoil amendment rate Layer 3"},{"$f":"Interventions!D5","v":"Class"},{"$f":"Interventions!E5","v":"-"},{"$f":"Interventions!F5","v":"Nil"},{"$f":"Interventions!G5","v":"Nil"},{"$f":"Interventions!H5","v":"As_Recommended"},{"$f":"Interventions!I5","v":"As_Recommended"},{"$f":"Interventions!J5","v":"Half_recommended"},{"$f":"Interventions!K5","v":"Half_recommended"},{"$f":"Interventions!L5","v":"-"},{"$f":"Interventions!M5","v":"-"},{"$f":"Interventions!N5","v":"-"},{"$f":"Interventions!O5","v":"-"},{"$f":"Interventions!P5","v":"-"},{"$f":"Interventions!Q5","v":"-"},{"$f":"Interventions!R5","v":"-"},{"$f":"Interventions!S5","v":"-"},{"$f":"Interventions!T5","v":"-"},{"$f":"Interventions!U5","v":"-"},{"$f":"Interventions!V5","v":"-"},{"$f":"Interventions!W5","v":"-"},{"$f":"Interventions!X5","v":"-"},{"$f":"Interventions!Y5","v":"-"}]
[{"$f":"Interventions!A7","v":14},{"$f":"Interventions!B7","v":"Spoil_amendment_type_1"},{"$f":"Interventions!C7","v":"Spoil amendment type Layer 1"},{"$f":"Interventions!D7","v":"Class"},{"$f":"Interventions!E7","v":"-"},{"$f":"Interventions!F7","v":"-"},{"$f":"Interventions!G7","v":"Gypsum"},{"$f":"Interventions!H7","v":"Gypsum"},{"$f":"Interventions!I7","v":"Gypsum"},{"$f":"Interventions!J7","v":"Gypsum"},{"$f":"Interventions!K7","v":"Gypsum"},{"$f":"Interventions!L7","v":"-"},{"$f":"Interventions!M7","v":"-"},{"$f":"Interventions!N7","v":"-"},{"$f":"Interventions!O7","v":"-"},{"$f":"Interventions!P7","v":"-"},{"$f":"Interventions!Q7","v":"-"},{"$f":"Interventions!R7","v":"-"},{"$f":"Interventions!S7","v":"-"},{"$f":"Interventions!T7","v":"-"},{"$f":"Interventions!U7","v":"-"},{"$f":"Interventions!V7","v":"-"},{"$f":"Interventions!W7","v":"-"},{"$f":"Interventions!X7","v":"-"},{"$f":"Interventions!Y7","v":"-"}]
[{"$f":"Interventions!A8","v":15},{"$f":"Interventions!B8","v":"Spoil_amendment_type_2"},{"$f":"Interventions!C8","v":"Spoil amendment type Layer 2"},{"$f":"Interventions!D8","v":"Class"},{"$f":"Interventions!E8","v":"-"},{"$f":"Interventions!F8","v":"-"},{"$f":"Interventions!G8","v":"Gypsum"},{"$f":"Interventions!H8","v":"Gypsum"},{"$f":"Interventions!I8","v":"Gypsum"},{"$f":"Interventions!J8","v":"Gypsum"},{"$f":"Interventions!K8","v":"Gypsum"},{"$f":"Interventions!L8","v":"-"},{"$f":"Interventions!M8","v":"-"},{"$f":"Interventions!N8","v":"-"},{"$f":"Interventions!O8","v":"-"},{"$f":"Interventions!P8","v":"-"},{"$f":"Interventions!Q8","v":"-"},{"$f":"Interventions!R8","v":"-"},{"$f":"Interventions!S8","v":"-"},{"$f":"Interventions!T8","v":"-"},{"$f":"Interventions!U8","v":"-"},{"$f":"Interventions!V8","v":"-"},{"$f":"Interventions!W8","v":"-"},{"$f":"Interventions!X8","v":"-"},{"$f":"Interventions!Y8","v":"-"}]
[{"$f":"Interventions!A9","v":16},{"$f":"Interventions!B9","v":"Spoil_amendment_type_3"},{"$f":"Interventions!C9","v":"Spoil amendment type Layer 3"},{"$f":"Interventions!D9","v":"Class"},{"$f":"Interventions!E9","v":"-"},{"$f":"Interventions!F9","v":"-"},{"$f":"Interventions!G9","v":"Gypsum"},{"$f":"Interventions!H9","v":"Gypsum"},{"$f":"Interventions!I9","v":"Gypsum"},{"$f":"Interventions!J9","v":"Gypsum"},{"$f":"Interventions!K9","v":"Gypsum"},{"$f":"Interventions!L9","v":"-"},{"$f":"Interventions!M9","v":"-"},{"$f":"Interventions!N9","v":"-"},{"$f":"Interventions!O9","v":"-"},{"$f":"Interventions!P9","v":"-"},{"$f":"Interventions!Q9","v":"-"},{"$f":"Interventions!R9","v":"-"},{"$f":"Interventions!S9","v":"-"},{"$f":"Interventions!T9","v":"-"},{"$f":"Interventions!U9","v":"-"},{"$f":"Interventions!V9","v":"-"},{"$f":"Interventions!W9","v":"-"},{"$f":"Interventions!X9","v":"-"},{"$f":"Interventions!Y9","v":"-"}]
[{"$f":"Interventions!A11","v":1},{"$f":"Interventions!B11","v":"Amendment_form_1"},{"$f":"Interventions!C11","v":"Amendment form Layer 1"},{"$f":"Interventions!D11","v":"Class"},{"$f":"Interventions!E11","v":"-"},{"$f":"Interventions!F11","v":"-"},{"$f":"Interventions!G11","v":"Granular"},{"$f":"Interventions!H11","v":"Granular"},{"$f":"Interventions!I11","v":"Granular"},{"$f":"Interventions!J11","v":"Granular"},{"$f":"Interventions!K11","v":"Granular"},{"$f":"Interventions!L11","v":"-"},{"$f":"Interventions!M11","v":"-"},{"$f":"Interventions!N11","v":"-"},{"$f":"Interventions!O11","v":"-"},{"$f":"Interventions!P11","v":"-"},{"$f":"Interventions!Q11","v":"-"},{"$f":"Interventions!R11","v":"-"},{"$f":"Interventions!S11","v":"-"},{"$f":"Interventions!T11","v":"-"},{"$f":"Interventions!U11","v":"-"},{"$f":"Interventions!V11","v":"-"},{"$f":"Interventions!W11","v":"-"},{"$f":"Interventions!X11","v":"-"},{"$f":"Interventions!Y11","v":"-"}]
[{"$f":"Interventions!A12","v":2},{"$f":"Interventions!B12","v":"Amendment_form_2"},{"$f":"Interventions!C12","v":"Amendment form Layer 2"},{"$f":"Interventions!D12","v":"Class"},{"$f":"Interventions!E12","v":"-"},{"$f":"Interventions!F12","v":"-"},{"$f":"Interventions!G12","v":"Granular"},{"$f":"Interventions!H12","v":"Granular"},{"$f":"Interventions!I12","v":"Granular"},{"$f":"Interventions!J12","v":"Granular"},{"$f":"Interventions!K12","v":"Granular"},{"$f":"Interventions!L12","v":"-"},{"$f":"Interventions!M12","v":"-"},{"$f":"Interventions!N12","v":"-"},{"$f":"Interventions!O12","v":"-"},{"$f":"Interventions!P12","v":"-"},{"$f":"Interventions!Q12","v":"-"},{"$f":"Interventions!R12","v":"-"},{"$f":"Interventions!S12","v":"-"},{"$f":"Interventions!T12","v":"-"},{"$f":"Interventions!U12","v":"-"},{"$f":"Interventions!V12","v":"-"},{"$f":"Interventions!W12","v":"-"},{"$f":"Interventions!X12","v":"-"},{"$f":"Interventions!Y12","v":"-"}]
[{"$f":"Interventions!A13","v":3},{"$f":"Interventions!B13","v":"Amendment_form_3"},{"$f":"Interventions!C13","v":"Amendment form Layer 3"},{"$f":"Interventions!D13","v":"Class"},{"$f":"Interventions!E13","v":"-"},{"$f":"Interventions!F13","v":"-"},{"$f":"Interventions!G13","v":"Granular"},{"$f":"Interventions!H13","v":"Granular"},{"$f":"Interventions!I13","v":"Granular"},{"$f":"Interventions!J13","v":"Granular"},{"$f":"Interventions!K13","v":"Granular"},{"$f":"Interventions!L13","v":"-"},{"$f":"Interventions!M13","v":"-"},{"$f":"Interventions!N13","v":"-"},{"$f":"Interventions!O13","v":"-"},{"$f":"Interventions!P13","v":"-"},{"$f":"Interventions!Q13","v":"-"},{"$f":"Interventions!R13","v":"-"},{"$f":"Interventions!S13","v":"-"},{"$f":"Interventions!T13","v":"-"},{"$f":"Interventions!U13","v":"-"},{"$f":"Interventions!V13","v":"-"},{"$f":"Interventions!W13","v":"-"},{"$f":"Interventions!X13","v":"-"},{"$f":"Interventions!Y13","v":"-"}]
[{"$f":"Interventions!A15","v":26},{"$f":"Interventions!B15","v":"Spoil_amendment_application_1"},{"$f":"Interventions!C15","v":"Topsoil amendment application method"},{"$f":"Interventions!D15","v":"Class"},{"$f":"Interventions!E15","v":"-"},{"$f":"Interventions!F15","v":"-"},{"$f":"Interventions!G15","v":"Incorporated"},{"$f":"Interventions!H15","v":"Incorporated"},{"$f":"Interventions!I15","v":"Incorporated"},{"$f":"Interventions!J15","v":"Incorporated"},{"$f":"Interventions!K15","v":"Incorporated"},{"$f":"Interventions!L15","v":"-"},{"$f":"Interventions!M15","v":"-"},{"$f":"Interventions!N15","v":"-"},{"$f":"Interventions!O15","v":"-"},{"$f":"Interventions!P15","v":"-"},{"$f":"Interventions!Q15","v":"-"},{"$f":"Interventions!R15","v":"-"},{"$f":"Interventions!S15","v":"-"},{"$f":"Interventions!T15","v":"-"},{"$f":"Interventions!U15","v":"-"},{"$f":"Interventions!V15","v":"-"},{"$f":"Interventions!W15","v":"-"},{"$f":"Interventions!X15","v":"-"},{"$f":"Interventions!Y15","v":"-"}]
[{"$f":"Interventions!A16","v":0},{"$f":"Interventions!B16","v":"Contour banks"}]
[{"$f":"Interventions!A17","v":19},{"$f":"Interventions!B17","v":"Contourbank_height"},{"$f":"Interventions!C17","v":"Contourbank height (mm)"},{"$f":"Interventions!D17","v":"Value"},{"$f":"Interventions!E17","v":"-"},{"$f":"Interventions!F17","v":500},{"$f":"Interventions!G17","v":0},{"$f":"Interventions!H17","v":500},{"$f":"Interventions!I17","v":500},{"$f":"Interventions!J17","v":500},{"$f":"Interventions!K17","v":500},{"$f":"Interventions!L17","v":"-"},{"$f":"Interventions!M17","v":"-"},{"$f":"Interventions!N17","v":"-"},{"$f":"Interventions!O17","v":"-"},{"$f":"Interventions!P17","v":"-"},{"$f":"Interventions!Q17","v":"-"},{"$f":"Interventions!R17","v":"-"},{"$f":"Interventions!S17","v":"-"},{"$f":"Interventions!T17","v":"-"},{"$f":"Interventions!U17","v":"-"},{"$f":"Interventions!V17","v":"-"},{"$f":"Interventions!W17","v":"-"},{"$f":"Interventions!X17","v":"-"},{"$f":"Interventions!Y17","v":"-"}]
[{"$f":"Interventions!A18","v":25},{"$f":"Interventions!B18","v":"Contourbank_Interval"},{"$f":"Interventions!C18","v":"Contourbank Interval (m)"},{"$f":"Interventions!D18","v":"Value"},{"$f":"Interventions!E18","v":"-"},{"$f":"Interventions!F18","v":20},{"$f":"Interventions!G18","v":20},{"$f":"Interventions!H18","v":20},{"$f":"Interventions!I18","v":20},{"$f":"Interventions!J18","v":20},{"$f":"Interventions!K18","v":20},{"$f":"Interventions!L18","v":"-"},{"$f":"Interventions!M18","v":"-"},{"$f":"Interventions!N18","v":"-"},{"$f":"Interventions!O18","v":"-"},{"$f":"Interventions!P18","v":"-"},{"$f":"Interventions!Q18","v":"-"},{"$f":"Interventions!R18","v":"-"},{"$f":"Interventions!S18","v":"-"},{"$f":"Interventions!T18","v":"-"},{"$f":"Interventions!U18","v":"-"},{"$f":"Interventions!V18","v":"-"},{"$f":"Interventions!W18","v":"-"},{"$f":"Interventions!X18","v":"-"},{"$f":"Interventions!Y18","v":"-"}]
[{"$f":"Interventions!A19","v":4},{"$f":"Interventions!B19","v":"Contourbank_permanence"},{"$f":"Interventions!C19","v":"Contourbank permanence"},{"$f":"Interventions!D19","v":"Class"},{"$f":"Interventions!E19","v":"-"},{"$f":"Interventions!F19","v":"Temporary"},{"$f":"Interventions!G19","v":"Temporary"},{"$f":"Interventions!H19","v":"Temporary"},{"$f":"Interventions!I19","v":"Temporary"},{"$f":"Interventions!J19","v":"Temporary"},{"$f":"Interventions!K19","v":"Temporary"},{"$f":"Interventions!L19","v":"-"},{"$f":"Interventions!M19","v":"-"},{"$f":"Interventions!N19","v":"-"},{"$f":"Interventions!O19","v":"-"},{"$f":"Interventions!P19","v":"-"},{"$f":"Interventions!Q19","v":"-"},{"$f":"Interventions!R19","v":"-"},{"$f":"Interventions!S19","v":"-"},{"$f":"Interventions!T19","v":"-"},{"$f":"Interventions!U19","v":"-"},{"$f":"Interventions!V19","v":"-"},{"$f":"Interventions!W19","v":"-"},{"$f":"Interventions!X19","v":"-"},{"$f":"Interventions!Y19","v":"-"}]
[{"$f":"Interventions!A20","v":17},{"$f":"Interventions!B20","v":"UpslopeBund"},{"$f":"Interventions!C20","v":"Upslope bund"},{"$f":"Interventions!D20","v":"Class"},{"$f":"Interventions!E20","v":"-"},{"$f":"Interventions!F20","v":"Yes"},{"$f":"Interventions!G20","v":"Yes"},{"$f":"Interventions!H20","v":"Yes"},{"$f":"Interventions!I20","v":"Yes"},{"$f":"Interventions!J20","v":"Yes"},{"$f":"Interventions!K20","v":"Yes"},{"$f":"Interventions!L20","v":"-"},{"$f":"Interventions!M20","v":"-"},{"$f":"Interventions!N20","v":"-"},{"$f":"Interventions!O20","v":"-"},{"$f":"Interventions!P20","v":"-"},{"$f":"Interventions!Q20","v":"-"},{"$f":"Interventions!R20","v":"-"},{"$f":"Interventions!S20","v":"-"},{"$f":"Interventions!T20","v":"-"},{"$f":"Interventions!U20","v":"-"},{"$f":"Interventions!V20","v":"-"},{"$f":"Interventions!W20","v":"-"},{"$f":"Interventions!X20","v":"-"},{"$f":"Interventions!Y20","v":"-"}]
[{"$f":"Interventions!A21","v":0},{"$f":"Interventions!B21","v":"Landform"}]
[{"$f":"Interventions!A22","v":23},{"$f":"Interventions!B22","v":"Slope_angle"},{"$f":"Interventions!C22","v":"Slope angle (%)"},{"$f":"Interventions!D22","v":"Value"},{"$f":"Interventions!E22","v":"-"},{"$f":"Interventions!F22","v":10},{"$f":"Interventions!G22","v":10},{"$f":"Interventions!H22","v":10},{"$f":"Interventions!I22","v":10},{"$f":"Interventions!J22","v":10},{"$f":"Interventions!K22","v":10},{"$f":"Interventions!L22","v":"-"},{"$f":"Interventions!M22","v":"-"},{"$f":"Interventions!N22","v":"-"},{"$f":"Interventions!O22","v":"-"},{"$f":"Interventions!P22","v":"-"},{"$f":"Interventions!Q22","v":"-"},{"$f":"Interventions!R22","v":"-"},{"$f":"Interventions!S22","v":"-"},{"$f":"Interventions!T22","v":"-"},{"$f":"Interventions!U22","v":"-"},{"$f":"Interventions!V22","v":"-"},{"$f":"Interventions!W22","v":"-"},{"$f":"Interventions!X22","v":"-"},{"$f":"Interventions!Y22","v":"-"}]
[{"$f":"Interventions!A23","v":21},{"$f":"Interventions!B23","v":"Overall_Slope_length"},{"$f":"Interventions!C23","v":"Overall slope length (m)"},{"$f":"Interventions!D23","v":"Value"},{"$f":"Interventions!E23","v":"-"},{"$f":"Interventions!F23","v":100},{"$f":"Interventions!G23","v":100},{"$f":"Interventions!H23","v":100},{"$f":"Interventions!I23","v":100},{"$f":"Interventions!J23","v":100},{"$f":"Interventions!K23","v":100},{"$f":"Interventions!L23","v":"-"},{"$f":"Interventions!M23","v":"-"},{"$f":"Interventions!N23","v":"-"},{"$f":"Interventions!O23","v":"-"},{"$f":"Interventions!P23","v":"-"},{"$f":"Interventions!Q23","v":"-"},{"$f":"Interventions!R23","v":"-"},{"$f":"Interventions!S23","v":"-"},{"$f":"Interventions!T23","v":"-"},{"$f":"Interventions!U23","v":"-"},{"$f":"Interventions!V23","v":"-"},{"$f":"Interventions!W23","v":"-"},{"$f":"Interventions!X23","v":"-"},{"$f":"Interventions!Y23","v":"-"}]
[{"$f":"Interventions!A24","v":10},{"$f":"Interventions!B24","v":"Slope_shape"},{"$f":"Interventions!C24","v":"Slope shape"},{"$f":"Interventions!D24","v":"Class"},{"$f":"Interventions!E24","v":"-"},{"$f":"Interventions!F24","v":"Linear"},{"$f":"Interventions!G24","v":"Linear"},{"$f":"Interventions!H24","v":"Linear"},{"$f":"Interventions!I24","v":"Linear"},{"$f":"Interventions!J24","v":"Linear"},{"$f":"Interventions!K24","v":"Linear"},{"$f":"Interventions!L24","v":"-"},{"$f":"Interventions!M24","v":"-"},{"$f":"Interventions!N24","v":"-"},{"$f":"Interventions!O24","v":"-"},{"$f":"Interventions!P24","v":"-"},{"$f":"Interventions!Q24","v":"-"},{"$f":"Interventions!R24","v":"-"},{"$f":"Interventions!S24","v":"-"},{"$f":"Interventions!T24","v":"-"},{"$f":"Interventions!U24","v":"-"},{"$f":"Interventions!V24","v":"-"},{"$f":"Interventions!W24","v":"-"},{"$f":"Interventions!X24","v":"-"},{"$f":"Interventions!Y24","v":"-"}]
[{"$f":"Interventions!A25","v":5},{"$f":"Interventions!B25","v":"Lateral_landform_uniformity"},{"$f":"Interventions!C25","v":"Lateral landform uniformity"},{"$f":"Interventions!D25","v":"Class"},{"$f":"Interventions!E25","v":"-"},{"$f":"Interventions!F25","v":"Flat_linear"},{"$f":"Interventions!G25","v":"Flat_linear"},{"$f":"Interventions!H25","v":"Flat_linear"},{"$f":"Interventions!I25","v":"Flat_linear"},{"$f":"Interventions!J25","v":"Flat_linear"},{"$f":"Interventions!K25","v":"Flat_linear"},{"$f":"Interventions!L25","v":"-"},{"$f":"Interventions!M25","v":"-"},{"$f":"Interventions!N25","v":"-"},{"$f":"Interventions!O25","v":"-"},{"$f":"Interventions!P25","v":"-"},{"$f":"Interventions!Q25","v":"-"},{"$f":"Interventions!R25","v":"-"},{"$f":"Interventions!S25","v":"-"},{"$f":"Interventions!T25","v":"-"},{"$f":"Interventions!U25","v":"-"},{"$f":"Interventions!V25","v":"-"},{"$f":"Interventions!W25","v":"-"},{"$f":"Interventions!X25","v":"-"},{"$f":"Interventions!Y25","v":"-"}]
[{"$f":"Interventions!A26","v":9},{"$f":"Interventions!B26","v":"Slope_Drainage_Type"},{"$f":"Interventions!C26","v":"Slope drainage type"},{"$f":"Interventions!D26","v":"Class"},{"$f":"Interventions!E26","v":"-"},{"$f":"Interventions!F26","v":"Grassed_drains"},{"$f":"Interventions!G26","v":"No_drainage"},{"$f":"Interventions!H26","v":"Grassed_drains"},{"$f":"Interventions!I26","v":"Grassed_drains"},{"$f":"Interventions!J26","v":"Grassed_drains"},{"$f":"Interventions!K26","v":"Grassed_drains"},{"$f":"Interventions!L26","v":"-"},{"$f":"Interventions!M26","v":"-"},{"$f":"Interventions!N26","v":"-"},{"$f":"Interventions!O26","v":"-"},{"$f":"Interventions!P26","v":"-"},{"$f":"Interventions!Q26","v":"-"},{"$f":"Interventions!R26","v":"-"},{"$f":"Interventions!S26","v":"-"},{"$f":"Interventions!T26","v":"-"},{"$f":"Interventions!U26","v":"-"},{"$f":"Interventions!V26","v":"-"},{"$f":"Interventions!W26","v":"-"},{"$f":"Interventions!X26","v":"-"},{"$f":"Interventions!Y26","v":"-"}]
[{"$f":"Interventions!A27","v":0},{"$f":"Interventions!B27","v":"Ripping"}]
[{"$f":"Interventions!A28","v":22},{"$f":"Interventions!B28","v":"Rip_depth"},{"$f":"Interventions!C28","v":"Rip depth (cm)"},{"$f":"Interventions!D28","v":"Class"},{"$f":"Interventions!E28","v":"-"},{"$f":"Interventions!F28","v":50},{"$f":"Interventions!G28","v":50},{"$f":"Interventions!H28","v":50},{"$f":"Interventions!I28","v":50},{"$f":"Interventions!J28","v":50},{"$f":"Interventions!K28","v":50},{"$f":"Interventions!L28","v":"-"},{"$f":"Interventions!M28","v":"-"},{"$f":"Interventions!N28","v":"-"},{"$f":"Interventions!O28","v":"-"},{"$f":"Interventions!P28","v":"-"},{"$f":"Interventions!Q28","v":"-"},{"$f":"Interventions!R28","v":"-"},{"$f":"Interventions!S28","v":"-"},{"$f":"Interventions!T28","v":"-"},{"$f":"Interventions!U28","v":"-"},{"$f":"Interventions!V28","v":"-"},{"$f":"Interventions!W28","v":"-"},{"$f":"Interventions!X28","v":"-"},{"$f":"Interventions!Y28","v":"-"}]
[{"$f":"Interventions!A29","v":8},{"$f":"Interventions!B29","v":"Rip_direction"},{"$f":"Interventions!C29","v":"Rip direction"},{"$f":"Interventions!D29","v":"Class"},{"$f":"Interventions!E29","v":"-"},{"$f":"Interventions!F29","v":"Grade_ripped_downslope"},{"$f":"Interventions!G29","v":"Contour_ripped"},{"$f":"Interventions!H29","v":"Grade_ripped_downslope"},{"$f":"Interventions!I29","v":"Grade_ripped_downslope"},{"$f":"Interventions!J29","v":"Grade_ripped_downslope"},{"$f":"Interventions!K29","v":"Grade_ripped_downslope"},{"$f":"Interventions!L29","v":"-"},{"$f":"Interventions!M29","v":"-"},{"$f":"Interventions!N29","v":"-"},{"$f":"Interventions!O29","v":"-"},{"$f":"Interventions!P29","v":"-"},{"$f":"Interventions!Q29","v":"-"},{"$f":"Interventions!R29","v":"-"},{"$f":"Interventions!S29","v":"-"},{"$f":"Interventions!T29","v":"-"},{"$f":"Interventions!U29","v":"-"},{"$f":"Interventions!V29","v":"-"},{"$f":"Interventions!W29","v":"-"},{"$f":"Interventions!X29","v":"-"},{"$f":"Interventions!Y29","v":"-"}]
[{"$f":"Interventions!A30","v":7},{"$f":"Interventions!B30","v":"Rip_conditions"},{"$f":"Interventions!C30","v":"Soil moisture at time of ripping"},{"$f":"Interventions!D30","v":"Class"},{"$f":"Interventions!E30","v":"-"},{"$f":"Interventions!F30","v":"Moist"},{"$f":"Interventions!G30","v":"Dry"},{"$f":"Interventions!H30","v":"Moist"},{"$f":"Interventions!I30","v":"Moist"},{"$f":"Interventions!J30","v":"Moist"},{"$f":"Interventions!K30","v":"Moist"},{"$f":"Interventions!L30","v":"-"},{"$f":"Interventions!M30","v":"-"},{"$f":"Interventions!N30","v":"-"},{"$f":"Interventions!O30","v":"-"},{"$f":"Interventions!P30","v":"-"},{"$f":"Interventions!Q30","v":"-"},{"$f":"Interventions!R30","v":"-"},{"$f":"Interventions!S30","v":"-"},{"$f":"Interventions!T30","v":"-"},{"$f":"Interventions!U30","v":"-"},{"$f":"Interventions!V30","v":"-"},{"$f":"Interventions!W30","v":"-"},{"$f":"Interventions!X30","v":"-"},{"$f":"Interventions!Y30","v":"-"}]
[{"$f":"Interventions!A31","v":0},{"$f":"Interventions!B31","v":"Surface armouring "}]
[{"$f":"Interventions!A32","v":6},{"$f":"Interventions!B32","v":"Mixing_topsoil_rockmulch"},{"$f":"Interventions!C32","v":"Rockmulch applied"},{"$f":"Interventions!D32","v":"Class"},{"$f":"Interventions!E32","v":"-"},{"$f":"Interventions!F32","v":"No"},{"$f":"Interventions!G32","v":"Yes"},{"$f":"Interventions!H32","v":"No"},{"$f":"Interventions!I32","v":"No"},{"$f":"Interventions!J32","v":"No"},{"$f":"Interventions!K32","v":"No"},{"$f":"Interventions!L32","v":"-"},{"$f":"Interventions!M32","v":"-"},{"$f":"Interventions!N32","v":"-"},{"$f":"Interventions!O32","v":"-"},{"$f":"Interventions!P32","v":"-"},{"$f":"Interventions!Q32","v":"-"},{"$f":"Interventions!R32","v":"-"},{"$f":"Interventions!S32","v":"-"},{"$f":"Interventions!T32","v":"-"},{"$f":"Interventions!U32","v":"-"},{"$f":"Interventions!V32","v":"-"},{"$f":"Interventions!W32","v":"-"},{"$f":"Interventions!X32","v":"-"},{"$f":"Interventions!Y32","v":"-"}]
[{"$f":"Interventions!A33","v":24},{"$f":"Interventions!B33","v":"Surface_armouring_quantity"},{"$f":"Interventions!C33","v":"Surface armouring depth (cm)"},{"$f":"Interventions!D33","v":"Value"},{"$f":"Interventions!E33","v":"-"},{"$f":"Interventions!F33","v":0},{"$f":"Interventions!G33","v":100},{"$f":"Interventions!H33","v":0},{"$f":"Interventions!I33","v":0},{"$f":"Interventions!J33","v":0},{"$f":"Interventions!K33","v":0},{"$f":"Interventions!L33","v":"-"},{"$f":"Interventions!M33","v":"-"},{"$f":"Interventions!N33","v":"-"},{"$f":"Interventions!O33","v":"-"},{"$f":"Interventions!P33","v":"-"},{"$f":"Interventions!Q33","v":"-"},{"$f":"Interventions!R33","v":"-"},{"$f":"Interventions!S33","v":"-"},{"$f":"Interventions!T33","v":"-"},{"$f":"Interventions!U33","v":"-"},{"$f":"Interventions!V33","v":"-"},{"$f":"Interventions!W33","v":"-"},{"$f":"Interventions!X33","v":"-"},{"$f":"Interventions!Y33","v":"-"}]
[{"$f":"Interventions!A34","v":30},{"$f":"Interventions!B34","v":"Surface_roughness_noVeg"},{"$f":"Interventions!C34","v":"Soil surface roughness (clod/rock size) (cm)"},{"$f":"Interventions!D34","v":"Value"},{"$f":"Interventions!E34","v":"Calculated by model.  Optional input"},{"$f":"Interventions!F34","v":5},{"$f":"Interventions!G34","v":50},{"$f":"Interventions!H34","v":10},{"$f":"Interventions!I34","v":10},{"$f":"Interventions!J34","v":10},{"$f":"Interventions!K34","v":10},{"$f":"Interventions!L34","v":"-"},{"$f":"Interventions!M34","v":"-"},{"$f":"Interventions!N34","v":"-"},{"$f":"Interventions!O34","v":"-"},{"$f":"Interventions!P34","v":"-"},{"$f":"Interventions!Q34","v":"-"},{"$f":"Interventions!R34","v":"-"},{"$f":"Interventions!S34","v":"-"},{"$f":"Interventions!T34","v":"-"},{"$f":"Interventions!U34","v":"-"},{"$f":"Interventions!V34","v":"-"},{"$f":"Interventions!W34","v":"-"},{"$f":"Interventions!X34","v":"-"},{"$f":"Interventions!Y34","v":"-"}]
[{"$f":"Interventions!A35","v":0},{"$f":"Interventions!B35","v":"Vegetation management"}]
[{"$f":"Interventions!A36","v":28},{"$f":"Interventions!B36","v":"ERA_landuse_designation"},{"$f":"Interventions!C36","v":"EA Landuse requirement"},{"$f":"Interventions!D36","v":"Class"},{"$f":"Interventions!E36","v":"-"},{"$f":"Interventions!F36","v":"Native_vegetation"},{"$f":"Interventions!G36","v":"Grazing"},{"$f":"Interventions!H36","v":"Native_vegetation"},{"$f":"Interventions!I36","v":"Native_vegetation"},{"$f":"Interventions!J36","v":"Native_vegetation"},{"$f":"Interventions!K36","v":"Native_vegetation"},{"$f":"Interventions!L36","v":"-"},{"$f":"Interventions!M36","v":"-"},{"$f":"Interventions!N36","v":"-"},{"$f":"Interventions!O36","v":"-"},{"$f":"Interventions!P36","v":"-"},{"$f":"Interventions!Q36","v":"-"},{"$f":"Interventions!R36","v":"-"},{"$f":"Interventions!S36","v":"-"},{"$f":"Interventions!T36","v":"-"},{"$f":"Interventions!U36","v":"-"},{"$f":"Interventions!V36","v":"-"},{"$f":"Interventions!W36","v":"-"},{"$f":"Interventions!X36","v":"-"},{"$f":"Interventions!Y36","v":"-"}]
[{"$f":"Interventions!A37","v":29},{"$f":"Interventions!B37","v":"Seed_Addition"},{"$f":"Interventions!C37","v":"Seed mix applied"},{"$f":"Interventions!D37","v":"Class"},{"$f":"Interventions!E37","v":"-"},{"$f":"Interventions!F37","v":"None"},{"$f":"Interventions!G37","v":"Mixed_Pasture_Covercrop_Spp"},{"$f":"Interventions!H37","v":"Mixed_Pasture_Covercrop_Spp"},{"$f":"Interventions!I37","v":"Mixed_Pasture_Covercrop_Spp"},{"$f":"Interventions!J37","v":"Mixed_Pasture_Covercrop_Spp"},{"$f":"Interventions!K37","v":"Mixed_Pasture_Covercrop_Spp"},{"$f":"Interventions!L37","v":"-"},{"$f":"Interventions!M37","v":"-"},{"$f":"Interventions!N37","v":"-"},{"$f":"Interventions!O37","v":"-"},{"$f":"Interventions!P37","v":"-"},{"$f":"Interventions!Q37","v":"-"},{"$f":"Interventions!R37","v":"-"},{"$f":"Interventions!S37","v":"-"},{"$f":"Interventions!T37","v":"-"},{"$f":"Interventions!U37","v":"-"},{"$f":"Interventions!V37","v":"-"},{"$f":"Interventions!W37","v":"-"},{"$f":"Interventions!X37","v":"-"},{"$f":"Interventions!Y37","v":"-"}]
[{"$f":"Interventions!A38","v":27},{"$f":"Interventions!B38","v":"Fertiliser_addition"},{"$f":"Interventions!C38","v":"Topsoil fertiliser addition"},{"$f":"Interventions!D38","v":"Class"},{"$f":"Interventions!E38","v":"-"},{"$f":"Interventions!F38","v":"No"},{"$f":"Interventions!G38","v":"Yes"},{"$f":"Interventions!H38","v":"Yes"},{"$f":"Interventions!I38","v":"Yes"},{"$f":"Interventions!J38","v":"Yes"},{"$f":"Interventions!K38","v":"Yes"},{"$f":"Interventions!L38","v":"-"},{"$f":"Interventions!M38","v":"-"},{"$f":"Interventions!N38","v":"-"},{"$f":"Interventions!O38","v":"-"},{"$f":"Interventions!P38","v":"-"},{"$f":"Interventions!Q38","v":"-"},{"$f":"Interventions!R38","v":"-"},{"$f":"Interventions!S38","v":"-"},{"$f":"Interventions!T38","v":"-"},{"$f":"Interventions!U38","v":"-"},{"$f":"Interventions!V38","v":"-"},{"$f":"Interventions!W38","v":"-"},{"$f":"Interventions!X38","v":"-"},{"$f":"Interventions!Y38","v":"-"}]
[{"$f":"Interventions!A39","v":20},{"$f":"Interventions!B39","v":"Organic_mulch"},{"$f":"Interventions!C39","v":"Organic mulch thickness (cm)"},{"$f":"Interventions!D39","v":"Value"},{"$f":"Interventions!E39","v":"-"},{"$f":"Interventions!F39","v":0},{"$f":"Interventions!G39","v":0},{"$f":"Interventions!H39","v":5},{"$f":"Interventions!I39","v":5},{"$f":"Interventions!J39","v":5},{"$f":"Interventions!K39","v":5},{"$f":"Interventions!L39","v":"-"},{"$f":"Interventions!M39","v":"-"},{"$f":"Interventions!N39","v":"-"},{"$f":"Interventions!O39","v":"-"},{"$f":"Interventions!P39","v":"-"},{"$f":"Interventions!Q39","v":"-"},{"$f":"Interventions!R39","v":"-"},{"$f":"Interventions!S39","v":"-"},{"$f":"Interventions!T39","v":"-"},{"$f":"Interventions!U39","v":"-"},{"$f":"Interventions!V39","v":"-"},{"$f":"Interventions!W39","v":"-"},{"$f":"Interventions!X39","v":"-"},{"$f":"Interventions!Y39","v":"-"}]
[{"$f":"Interventions!A40","v":18},{"$f":"Interventions!B40","v":"Irrigation"},{"$f":"Interventions!C40","v":"Irrigation"},{"$f":"Interventions!D40","v":"Class"},{"$f":"Interventions!E40","v":"-"},{"$f":"Interventions!F40","v":"No"},{"$f":"Interventions!G40","v":"No"},{"$f":"Interventions!H40","v":"Yes"},{"$f":"Interventions!I40","v":"Yes"},{"$f":"Interventions!J40","v":"Yes"},{"$f":"Interventions!K40","v":"Yes"},{"$f":"Interventions!L40","v":"-"},{"$f":"Interventions!M40","v":"-"},{"$f":"Interventions!N40","v":"-"},{"$f":"Interventions!O40","v":"-"},{"$f":"Interventions!P40","v":"-"},{"$f":"Interventions!Q40","v":"-"},{"$f":"Interventions!R40","v":"-"},{"$f":"Interventions!S40","v":"-"},{"$f":"Interventions!T40","v":"-"},{"$f":"Interventions!U40","v":"-"},{"$f":"Interventions!V40","v":"-"},{"$f":"Interventions!W40","v":"-"},{"$f":"Interventions!X40","v":"-"},{"$f":"Interventions!Y40","v":"-"}]
[null,"Soil Chemical"]
[{"$f":"'Soil Chemical'!A2","v":0},{"$f":"'Soil Chemical'!B2","v":"pH"}]
[{"$f":"'Soil Chemical'!A3","v":10},{"$f":"'Soil Chemical'!B3","v":"pH_1"},{"$f":"'Soil Chemical'!C3","v":"pH (water) Layer 1"},{"$f":"'Soil Chemical'!D3","v":"Value"},{"$f":"'Soil Chemical'!E3","v":"-"},{"$f":"'Soil Chemical'!F3","v":5.7},{"$f":"'Soil Chemical'!G3","v":5.7},{"$f":"'Soil Chemical'!H3","v":5.7},{"$f":"'Soil Chemical'!I3","v":5.7},{"$f":"'Soil Chemical'!J3","v":5.7},{"$f":"'Soil Chemical'!K3","v":5.7},{"$f":"'Soil Chemical'!L3","v":"-"},{"$f":"'Soil Chemical'!M3","v":"-"},{"$f":"'Soil Chemical'!N3","v":"-"},{"$f":"'Soil Chemical'!O3","v":"-"},{"$f":"'Soil Chemical'!P3","v":"-"},{"$f":"'Soil Chemical'!Q3","v":"-"},{"$f":"'Soil Chemical'!R3","v":"-"},{"$f":"'Soil Chemical'!S3","v":"-"},{"$f":"'Soil Chemical'!T3","v":"-"},{"$f":"'Soil Chemical'!U3","v":"-"},{"$f":"'Soil Chemical'!V3","v":"-"},{"$f":"'Soil Chemical'!W3","v":"-"},{"$f":"'Soil Chemical'!X3","v":"-"},{"$f":"'Soil Chemical'!Y3","v":"-"}]
[{"$f":"'Soil Chemical'!A4","v":11},{"$f":"'Soil Chemical'!B4","v":"pH_2"},{"$f":"'Soil Chemical'!C4","v":"pH (water) Layer 2"},{"$f":"'Soil Chemical'!D4","v":"Value"},{"$f":"'Soil Chemical'!E4","v":"-"},{"$f":"'Soil Chemical'!F4","v":5.7},{"$f":"'Soil Chemical'!G4","v":5.7},{"$f":"'Soil Chemical'!H4","v":5.7},{"$f":"'Soil Chemical'!I4","v":5.7},{"$f":"'Soil Chemical'!J4","v":5.7},{"$f":"'Soil Chemical'!K4","v":5.7},{"$f":"'Soil Chemical'!L4","v":"-"},{"$f":"'Soil Chemical'!M4","v":"-"},{"$f":"'Soil Chemical'!N4","v":"-"},{"$f":"'Soil Chemical'!O4","v":"-"},{"$f":"'Soil Chemical'!P4","v":"-"},{"$f":"'Soil Chemical'!Q4","v":"-"},{"$f":"'Soil Chemical'!R4","v":"-"},{"$f":"'Soil Chemical'!S4","v":"-"},{"$f":"'Soil Chemical'!T4","v":"-"},{"$f":"'Soil Chemical'!U4","v":"-"},{"$f":"'Soil Chemical'!V4","v":"-"},{"$f":"'Soil Chemical'!W4","v":"-"},{"$f":"'Soil Chemical'!X4","v":"-"},{"$f":"'Soil Chemical'!Y4","v":"-"}]
[{"$f":"'Soil Chemical'!A5","v":12},{"$f":"'Soil Chemical'!B5","v":"pH_3"},{"$f":"'Soil Chemical'!C5","v":"pH (water) Layer 3"},{"$f":"'Soil Chemical'!D5","v":"Value"},{"$f":"'Soil Chemical'!E5","v":"--"},{"$f":"'Soil Chemical'!F5","v":"-"},{"$f":"'Soil Chemical'!G5","v":"-"},{"$f":"'Soil Chemical'!H5","v":"-"},{"$f":"'Soil Chemical'!I5","v":"-"},{"$f":"'Soil Chemical'!J5","v":"-"},{"$f":"'Soil Chemical'!K5","v":"-"},{"$f":"'Soil Chemical'!L5","v":"-"},{"$f":"'Soil Chemical'!M5","v":"-"},{"$f":"'Soil Chemical'!N5","v":"-"},{"$f":"'Soil Chemical'!O5","v":"-"},{"$f":"'Soil Chemical'!P5","v":"-"},{"$f":"'Soil Chemical'!Q5","v":"-"},{"$f":"'Soil Chemical'!R5","v":"-"},{"$f":"'Soil Chemical'!S5","v":"-"},{"$f":"'Soil Chemical'!T5","v":"-"},{"$f":"'Soil Chemical'!U5","v":"-"},{"$f":"'Soil Chemical'!V5","v":"-"},{"$f":"'Soil Chemical'!W5","v":"-"},{"$f":"'Soil Chemical'!X5","v":"-"},{"$f":"'Soil Chemical'!Y5","v":"-"}]
[{"$f":"'Soil Chemical'!A6","v":0},{"$f":"'Soil Chemical'!B6","v":"EC (1:5)"}]
[{"$f":"'Soil Chemical'!A7","v":1},{"$f":"'Soil Chemical'!B7","v":"EC_1"},{"$f":"'Soil Chemical'!C7","v":"EC (1:5) Layer 1 (dS/m)"},{"$f":"'Soil Chemical'!D7","v":"Value"},{"$f":"'Soil Chemical'!E7","v":"-"},{"$f":"'Soil Chemical'!F7","v":0.7},{"$f":"'Soil Chemical'!G7","v":{"v":0.28,"d":"0.3"}},{"$f":"'Soil Chemical'!H7","v":{"v":0.28,"d":"0.3"}},{"$f":"'Soil Chemical'!I7","v":{"v":0.28,"d":"0.3"}},{"$f":"'Soil Chemical'!J7","v":{"v":0.28,"d":"0.3"}},{"$f":"'Soil Chemical'!K7","v":{"v":0.28,"d":"0.3"}},{"$f":"'Soil Chemical'!L7","v":"-"},{"$f":"'Soil Chemical'!M7","v":"-"},{"$f":"'Soil Chemical'!N7","v":"-"},{"$f":"'Soil Chemical'!O7","v":"-"},{"$f":"'Soil Chemical'!P7","v":"-"},{"$f":"'Soil Chemical'!Q7","v":"-"},{"$f":"'Soil Chemical'!R7","v":"-"},{"$f":"'Soil Chemical'!S7","v":"-"},{"$f":"'Soil Chemical'!T7","v":"-"},{"$f":"'Soil Chemical'!U7","v":"-"},{"$f":"'Soil Chemical'!V7","v":"-"},{"$f":"'Soil Chemical'!W7","v":"-"},{"$f":"'Soil Chemical'!X7","v":"-"},{"$f":"'Soil Chemical'!Y7","v":"-"}]
[{"$f":"'Soil Chemical'!A8","v":2},{"$f":"'Soil Chemical'!B8","v":"EC_2"},{"$f":"'Soil Chemical'!C8","v":"EC (1:5) Layer 2 (dS/m)"},{"$f":"'Soil Chemical'!D8","v":"Value"},{"$f":"'Soil Chemical'!E8","v":"-"},{"$f":"'Soil Chemical'!F8","v":0.7},{"$f":"'Soil Chemical'!G8","v":{"v":0.34,"d":"0.3"}},{"$f":"'Soil Chemical'!H8","v":{"v":0.34,"d":"0.3"}},{"$f":"'Soil Chemical'!I8","v":{"v":0.34,"d":"0.3"}},{"$f":"'Soil Chemical'!J8","v":{"v":0.34,"d":"0.3"}},{"$f":"'Soil Chemical'!K8","v":{"v":0.34,"d":"0.3"}},{"$f":"'Soil Chemical'!L8","v":"-"},{"$f":"'Soil Chemical'!M8","v":"-"},{"$f":"'Soil Chemical'!N8","v":"-"},{"$f":"'Soil Chemical'!O8","v":"-"},{"$f":"'Soil Chemical'!P8","v":"-"},{"$f":"'Soil Chemical'!Q8","v":"-"},{"$f":"'Soil Chemical'!R8","v":"-"},{"$f":"'Soil Chemical'!S8","v":"-"},{"$f":"'Soil Chemical'!T8","v":"-"},{"$f":"'Soil Chemical'!U8","v":"-"},{"$f":"'Soil Chemical'!V8","v":"-"},{"$f":"'Soil Chemical'!W8","v":"-"},{"$f":"'Soil Chemical'!X8","v":"-"},{"$f":"'Soil Chemical'!Y8","v":"-"}]
[{"$f":"'Soil Chemical'!A9","v":3},{"$f":"'Soil Chemical'!B9","v":"EC_3"},{"$f":"'Soil Chemical'!C9","v":"EC (1:5) Layer 3 (dS/m)"},{"$f":"'Soil Chemical'!D9","v":"Value"},{"$f":"'Soil Chemical'!E9","v":"-"},{"$f":"'Soil Chemical'!F9","v":0.7},{"$f":"'Soil Chemical'!G9","v":{"v":0.34,"d":"0.3"}},{"$f":"'Soil Chemical'!H9","v":{"v":0.34,"d":"0.3"}},{"$f":"'Soil Chemical'!I9","v":{"v":0.34,"d":"0.3"}},{"$f":"'Soil Chemical'!J9","v":{"v":0.34,"d":"0.3"}},{"$f":"'Soil Chemical'!K9","v":{"v":0.34,"d":"0.3"}},{"$f":"'Soil Chemical'!L9","v":"-"},{"$f":"'Soil Chemical'!M9","v":"-"},{"$f":"'Soil Chemical'!N9","v":"-"},{"$f":"'Soil Chemical'!O9","v":"-"},{"$f":"'Soil Chemical'!P9","v":"-"},{"$f":"'Soil Chemical'!Q9","v":"-"},{"$f":"'Soil Chemical'!R9","v":"-"},{"$f":"'Soil Chemical'!S9","v":"-"},{"$f":"'Soil Chemical'!T9","v":"-"},{"$f":"'Soil Chemical'!U9","v":"-"},{"$f":"'Soil Chemical'!V9","v":"-"},{"$f":"'Soil Chemical'!W9","v":"-"},{"$f":"'Soil Chemical'!X9","v":"-"},{"$f":"'Soil Chemical'!Y9","v":"-"}]
[{"$f":"'Soil Chemical'!A10","v":0},{"$f":"'Soil Chemical'!B10","v":"Cations (Sodium)"}]
[{"$f":"'Soil Chemical'!A11","v":7},{"$f":"'Soil Chemical'!B11","v":"Na_ex_1"},{"$f":"'Soil Chemical'!C11","v":"Exchangeable Sodium Layer 1 (meq/100g)"},{"$f":"'Soil Chemical'!D11","v":"Value"},{"$f":"'Soil Chemical'!E11","v":"-"},{"$f":"'Soil Chemical'!F11","v":{"v":5,"d":"5.0"}},{"$f":"'Soil Chemical'!G11","v":{"v":0.3936605316973415,"d":"0.4"}},{"$f":"'Soil Chemical'!H11","v":{"v":0.3936605316973415,"d":"0.4"}},{"$f":"'Soil Chemical'!I11","v":{"v":0.3936605316973415,"d":"0.4"}},{"$f":"'Soil Chemical'!J11","v":{"v":2,"d":"2.0"}},{"$f":"'Soil Chemical'!K11","v":{"v":2,"d":"2.0"}},{"$f":"'Soil Chemical'!L11","v":"-"},{"$f":"'Soil Chemical'!M11","v":"-"},{"$f":"'Soil Chemical'!N11","v":"-"},{"$f":"'Soil Chemical'!O11","v":"-"},{"$f":"'Soil Chemical'!P11","v":"-"},{"$f":"'Soil Chemical'!Q11","v":"-"},{"$f":"'Soil Chemical'!R11","v":"-"},{"$f":"'Soil Chemical'!S11","v":"-"},{"$f":"'Soil Chemical'!T11","v":"-"},{"$f":"'Soil Chemical'!U11","v":"-"},{"$f":"'Soil Chemical'!V11","v":"-"},{"$f":"'Soil Chemical'!W11","v":"-"},{"$f":"'Soil Chemical'!X11","v":"-"},{"$f":"'Soil Chemical'!Y11","v":"-"}]
[{"$f":"'Soil Chemical'!A12","v":8},{"$f":"'Soil Chemical'!B12","v":"Na_ex_2"},{"$f":"'Soil Chemical'!C12","v":"Exchangeable Sodium Layer 2 (meq/100g)"},{"$f":"'Soil Chemical'!D12","v":"Value"},{"$f":"'Soil Chemical'!E12","v":"-"},{"$f":"'Soil Chemical'!F12","v":{"v":5,"d":"5.0"}},{"$f":"'Soil Chemical'!G12","v":{"v":0.8650793650793652,"d":"0.9"}},{"$f":"'Soil Chemical'!H12","v":{"v":0.8650793650793652,"d":"0.9"}},{"$f":"'Soil Chemical'!I12","v":{"v":0.8650793650793652,"d":"0.9"}},{"$f":"'Soil Chemical'!J12","v":{"v":2,"d":"2.0"}},{"$f":"'Soil Chemical'!K12","v":{"v":2,"d":"2.0"}},{"$f":"'Soil Chemical'!L12","v":"-"},{"$f":"'Soil Chemical'!M12","v":"-"},{"$f":"'Soil Chemical'!N12","v":"-"},{"$f":"'Soil Chemical'!O12","v":"-"},{"$f":"'Soil Chemical'!P12","v":"-"},{"$f":"'Soil Chemical'!Q12","v":"-"},{"$f":"'Soil Chemical'!R12","v":"-"},{"$f":"'Soil Chemical'!S12","v":"-"},{"$f":"'Soil Chemical'!T12","v":"-"},{"$f":"'Soil Chemical'!U12","v":"-"},{"$f":"'Soil Chemical'!V12","v":"-"},{"$f":"'Soil Chemical'!W12","v":"-"},{"$f":"'Soil Chemical'!X12","v":"-"},{"$f":"'Soil Chemical'!Y12","v":"-"}]
[{"$f":"'Soil Chemical'!A13","v":9},{"$f":"'Soil Chemical'!B13","v":"Na_ex_3"},{"$f":"'Soil Chemical'!C13","v":"Exchangeable Sodium Layer 3 (meq/100g)"},{"$f":"'Soil Chemical'!D13","v":"Value"},{"$f":"'Soil Chemical'!E13","v":"-"},{"$f":"'Soil Chemical'!F13","v":{"v":5,"d":"5.0"}},{"$f":"'Soil Chemical'!G13","v":{"v":0.8650793650793652,"d":"0.9"}},{"$f":"'Soil Chemical'!H13","v":{"v":0.8650793650793652,"d":"0.9"}},{"$f":"'Soil Chemical'!I13","v":{"v":0.8650793650793652,"d":"0.9"}},{"$f":"'Soil Chemical'!J13","v":{"v":2,"d":"2.0"}},{"$f":"'Soil Chemical'!K13","v":{"v":2,"d":"2.0"}},{"$f":"'Soil Chemical'!L13","v":"-"},{"$f":"'Soil Chemical'!M13","v":"-"},{"$f":"'Soil Chemical'!N13","v":"-"},{"$f":"'Soil Chemical'!O13","v":"-"},{"$f":"'Soil Chemical'!P13","v":"-"},{"$f":"'Soil Chemical'!Q13","v":"-"},{"$f":"'Soil Chemical'!R13","v":"-"},{"$f":"'Soil Chemical'!S13","v":"-"},{"$f":"'Soil Chemical'!T13","v":"-"},{"$f":"'Soil Chemical'!U13","v":"-"},{"$f":"'Soil Chemical'!V13","v":"-"},{"$f":"'Soil Chemical'!W13","v":"-"},{"$f":"'Soil Chemical'!X13","v":"-"},{"$f":"'Soil Chemical'!Y13","v":"-"}]
[{"$f":"'Soil Chemical'!A14","v":0},{"$f":"'Soil Chemical'!B14","v":"Cations (Potassium)"}]
[{"$f":"'Soil Chemical'!A15","v":4},{"$f":"'Soil Chemical'!B15","v":"K_ex_1"},{"$f":"'Soil Chemical'!C15","v":"Exchangeable Potassium Layer 1 (meq/100g)"},{"$f":"'Soil Chemical'!D15","v":"Value"},{"$f":"'Soil Chemical'!E15","v":"-"},{"$f":"'Soil Chemical'!F15","v":0.3},{"$f":"'Soil Chemical'!G15","v":{"v":0.64,"d":"0.6"}},{"$f":"'Soil Chemical'!H15","v":{"v":0.64,"d":"0.6"}},{"$f":"'Soil Chemical'!I15","v":{"v":0.64,"d":"0.6"}},{"$f":"'Soil Chemical'!J15","v":{"v":0.64,"d":"0.6"}},{"$f":"'Soil Chemical'!K15","v":{"v":0.64,"d":"0.6"}},{"$f":"'Soil Chemical'!L15","v":"-"},{"$f":"'Soil Chemical'!M15","v":"-"},{"$f":"'Soil Chemical'!N15","v":"-"},{"$f":"'Soil Chemical'!O15","v":"-"},{"$f":"'Soil Chemical'!P15","v":"-"},{"$f":"'Soil Chemical'!Q15","v":"-"},{"$f":"'Soil Chemical'!R15","v":"-"},{"$f":"'Soil Chemical'!S15","v":"-"},{"$f":"'Soil Chemical'!T15","v":"-"},{"$f":"'Soil Chemical'!U15","v":"-"},{"$f":"'Soil Chemical'!V15","v":"-"},{"$f":"'Soil Chemical'!W15","v":"-"},{"$f":"'Soil Chemical'!X15","v":"-"},{"$f":"'Soil Chemical'!Y15","v":"-"}]
[{"$f":"'Soil Chemical'!A16","v":5},{"$f":"'Soil Chemical'!B16","v":"K_ex_2"},{"$f":"'Soil Chemical'!C16","v":"Exchangeable Potassium Layer 2 (meq/100g)"},{"$f":"'Soil Chemical'!D16","v":"Value"},{"$f":"'Soil Chemical'!E16","v":"-"},{"$f":"'Soil Chemical'!F16","v":0.3},{"$f":"'Soil Chemical'!G16","v":0.5},{"$f":"'Soil Chemical'!H16","v":0.5},{"$f":"'Soil Chemical'!I16","v":0.5},{"$f":"'Soil Chemical'!J16","v":0.5},{"$f":"'Soil Chemical'!K16","v":0.5},{"$f":"'Soil Chemical'!L16","v":"-"},{"$f":"'Soil Chemical'!M16","v":"-"},{"$f":"'Soil Chemical'!N16","v":"-"},{"$f":"'Soil Chemical'!O16","v":"-"},{"$f":"'Soil Chemical'!P16","v":"-"},{"$f":"'Soil Chemical'!Q16","v":"-"},{"$f":"'Soil Chemical'!R16","v":"-"},{"$f":"'Soil Chemical'!S16","v":"-"},{"$f":"'Soil Chemical'!T16","v":"-"},{"$f":"'Soil Chemical'!U16","v":"-"},{"$f":"'Soil Chemical'!V16","v":"-"},{"$f":"'Soil Chemical'!W16","v":"-"},{"$f":"'Soil Chemical'!X16","v":"-"},{"$f":"'Soil Chemical'!Y16","v":"-"}]
[{"$f":"'Soil Chemical'!A17","v":6},{"$f":"'Soil Chemical'!B17","v":"K_ex_3"},{"$f":"'Soil Chemical'!C17","v":"Exchangeable Potassium Layer 3 (meq/100g)"},{"$f":"'Soil Chemical'!D17","v":"Value"},{"$f":"'Soil Chemical'!E17","v":"-"},{"$f":"'Soil Chemical'!F17","v":0.3},{"$f":"'Soil Chemical'!G17","v":0.5},{"$f":"'Soil Chemical'!H17","v":0.5},{"$f":"'Soil Chemical'!I17","v":0.5},{"$f":"'Soil Chemical'!J17","v":0.5},{"$f":"'Soil Chemical'!K17","v":0.5},{"$f":"'Soil Chemical'!L17","v":"-"},{"$f":"'Soil Chemical'!M17","v":"-"},{"$f":"'Soil Chemical'!N17","v":"-"},{"$f":"'Soil Chemical'!O17","v":"-"},{"$f":"'Soil Chemical'!P17","v":"-"},{"$f":"'Soil Chemical'!Q17","v":"-"},{"$f":"'Soil Chemical'!R17","v":"-"},{"$f":"'Soil Chemical'!S17","v":"-"},{"$f":"'Soil Chemical'!T17","v":"-"},{"$f":"'Soil Chemical'!U17","v":"-"},{"$f":"'Soil Chemical'!V17","v":"-"},{"$f":"'Soil Chemical'!W17","v":"-"},{"$f":"'Soil Chemical'!X17","v":"-"},{"$f":"'Soil Chemical'!Y17","v":"-"}]
[{"$f":"'Soil Chemical'!A18","v":0},{"$f":"'Soil Chemical'!B18","v":"Exchangeable dispersion percentage"}]
[{"$f":"'Soil Chemical'!A19","v":13},{"$f":"'Soil Chemical'!B19","v":"EDP_1"},{"$f":"'Soil Chemical'!C19","v":"Exchangeable dispersive percentage Layer 1 (%)"},{"$f":"'Soil Chemical'!D19","v":"Calculated by model"},{"$f":"'Soil Chemical'!E19","v":"Model asks for input, but should be calcuated"},{"$f":"'Soil Chemical'!F19","v":35.8},{"$f":"'Soil Chemical'!G19","v":{"v":3,"d":"3.0"}},{"$f":"'Soil Chemical'!H19","v":{"v":3,"d":"3.0"}},{"$f":"'Soil Chemical'!I19","v":{"v":3,"d":"3.0"}},{"$f":"'Soil Chemical'!J19","v":{"v":15,"d":"15.0"}},{"$f":"'Soil Chemical'!K19","v":{"v":15,"d":"15.0"}},{"$f":"'Soil Chemical'!L19","v":"-"},{"$f":"'Soil Chemical'!M19","v":"-"},{"$f":"'Soil Chemical'!N19","v":"-"},{"$f":"'Soil Chemical'!O19","v":"-"},{"$f":"'Soil Chemical'!P19","v":"-"},{"$f":"'Soil Chemical'!Q19","v":"-"},{"$f":"'Soil Chemical'!R19","v":"-"},{"$f":"'Soil Chemical'!S19","v":"-"},{"$f":"'Soil Chemical'!T19","v":"-"},{"$f":"'Soil Chemical'!U19","v":"-"},{"$f":"'Soil Chemical'!V19","v":"-"},{"$f":"'Soil Chemical'!W19","v":"-"},{"$f":"'Soil Chemical'!X19","v":"-"},{"$f":"'Soil Chemical'!Y19","v":"-"}]
[{"$f":"'Soil Chemical'!A20","v":14},{"$f":"'Soil Chemical'!B20","v":"EDP_2"},{"$f":"'Soil Chemical'!C20","v":"Exchangeable dispersive percentage Layer 2 (%)"},{"$f":"'Soil Chemical'!D20","v":"Calculated by model"},{"$f":"'Soil Chemical'!E20","v":"Model asks for input, but should be calcuated"},{"$f":"'Soil Chemical'!F20","v":35.8},{"$f":"'Soil Chemical'!G20","v":{"v":6,"d":"6.0"}},{"$f":"'Soil Chemical'!H20","v":{"v":6,"d":"6.0"}},{"$f":"'Soil Chemical'!I20","v":{"v":6,"d":"6.0"}},{"$f":"'Soil Chemical'!J20","v":{"v":15,"d":"15.0"}},{"$f":"'Soil Chemical'!K20","v":{"v":15,"d":"15.0"}},{"$f":"'Soil Chemical'!L20","v":"-"},{"$f":"'Soil Chemical'!M20","v":"-"},{"$f":"'Soil Chemical'!N20","v":"-"},{"$f":"'Soil Chemical'!O20","v":"-"},{"$f":"'Soil Chemical'!P20","v":"-"},{"$f":"'Soil Chemical'!Q20","v":"-"},{"$f":"'Soil Chemical'!R20","v":"-"},{"$f":"'Soil Chemical'!S20","v":"-"},{"$f":"'Soil Chemical'!T20","v":"-"},{"$f":"'Soil Chemical'!U20","v":"-"},{"$f":"'Soil Chemical'!V20","v":"-"},{"$f":"'Soil Chemical'!W20","v":"-"},{"$f":"'Soil Chemical'!X20","v":"-"},{"$f":"'Soil Chemical'!Y20","v":"-"}]
[{"$f":"'Soil Chemical'!A21","v":15},{"$f":"'Soil Chemical'!B21","v":"EDP_3"},{"$f":"'Soil Chemical'!C21","v":"Exchangeable dispersive percentage Layer 3 (%)"},{"$f":"'Soil Chemical'!D21","v":"Calculated by model"},{"$f":"'Soil Chemical'!E21","v":"Model asks for input, but should be calcuated"},{"$f":"'Soil Chemical'!F21","v":35.8},{"$f":"'Soil Chemical'!G21","v":{"v":6,"d":"6.0"}},{"$f":"'Soil Chemical'!H21","v":{"v":6,"d":"6.0"}},{"$f":"'Soil Chemical'!I21","v":{"v":6,"d":"6.0"}},{"$f":"'Soil Chemical'!J21","v":{"v":15,"d":"15.0"}},{"$f":"'Soil Chemical'!K21","v":{"v":15,"d":"15.0"}},{"$f":"'Soil Chemical'!L21","v":"-"},{"$f":"'Soil Chemical'!M21","v":"-"},{"$f":"'Soil Chemical'!N21","v":"-"},{"$f":"'Soil Chemical'!O21","v":"-"},{"$f":"'Soil Chemical'!P21","v":"-"},{"$f":"'Soil Chemical'!Q21","v":"-"},{"$f":"'Soil Chemical'!R21","v":"-"},{"$f":"'Soil Chemical'!S21","v":"-"},{"$f":"'Soil Chemical'!T21","v":"-"},{"$f":"'Soil Chemical'!U21","v":"-"},{"$f":"'Soil Chemical'!V21","v":"-"},{"$f":"'Soil Chemical'!W21","v":"-"},{"$f":"'Soil Chemical'!X21","v":"-"},{"$f":"'Soil Chemical'!Y21","v":"-"}]
[null,"Soil Physical"]
[{"$f":"'Soil physical'!A2","v":0},{"$f":"'Soil physical'!B2","v":"Clay"}]
[{"$f":"'Soil physical'!A3","v":3},{"$f":"'Soil physical'!B3","v":"Clay_1"},{"$f":"'Soil physical'!C3","v":"Clay proportion Layer 1 (%)"},{"$f":"'Soil physical'!D3","v":"Value"},{"$f":"'Soil physical'!E3","v":"-"},{"$f":"'Soil physical'!F3","v":35.5},{"$f":"'Soil physical'!G3","v":{"v":9.75,"d":"9.8"}},{"$f":"'Soil physical'!H3","v":35.5},{"$f":"'Soil physical'!I3","v":35.5},{"$f":"'Soil physical'!J3","v":35.5},{"$f":"'Soil physical'!K3","v":35.5},{"$f":"'Soil physical'!L3","v":"-"},{"$f":"'Soil physical'!M3","v":"-"},{"$f":"'Soil physical'!N3","v":"-"},{"$f":"'Soil physical'!O3","v":"-"},{"$f":"'Soil physical'!P3","v":"-"},{"$f":"'Soil physical'!Q3","v":"-"},{"$f":"'Soil physical'!R3","v":"-"},{"$f":"'Soil physical'!S3","v":"-"},{"$f":"'Soil physical'!T3","v":"-"},{"$f":"'Soil physical'!U3","v":"-"},{"$f":"'Soil physical'!V3","v":"-"},{"$f":"'Soil physical'!W3","v":"-"},{"$f":"'Soil physical'!X3","v":"-"},{"$f":"'Soil physical'!Y3","v":"-"}]
[{"$f":"'Soil physical'!A4","v":4},{"$f":"'Soil physical'!B4","v":"Clay_2"},{"$f":"'Soil physical'!C4","v":"Clay proportion Layer 2 (%)"},{"$f":"'Soil physical'!D4","v":"Value"},{"$f":"'Soil physical'!E4","v":"-"},{"$f":"'Soil physical'!F4","v":35.5},{"$f":"'Soil physical'!G4","v":{"v":8.25,"d":"8.3"}},{"$f":"'Soil physical'!H4","v":35.5},{"$f":"'Soil physical'!I4","v":35.5},{"$f":"'Soil physical'!J4","v":35.5},{"$f":"'Soil physical'!K4","v":35.5},{"$f":"'Soil physical'!L4","v":"-"},{"$f":"'Soil physical'!M4","v":"-"},{"$f":"'Soil physical'!N4","v":"-"},{"$f":"'Soil physical'!O4","v":"-"},{"$f":"'Soil physical'!P4","v":"-"},{"$f":"'Soil physical'!Q4","v":"-"},{"$f":"'Soil physical'!R4","v":"-"},{"$f":"'Soil physical'!S4","v":"-"},{"$f":"'Soil physical'!T4","v":"-"},{"$f":"'Soil physical'!U4","v":"-"},{"$f":"'Soil physical'!V4","v":"-"},{"$f":"'Soil physical'!W4","v":"-"},{"$f":"'Soil physical'!X4","v":"-"},{"$f":"'Soil physical'!Y4","v":"-"}]
[{"$f":"'Soil physical'!A5","v":0},{"$f":"'Soil physical'!B5","v":"Sand"}]
[{"$f":"'Soil physical'!A6","v":7},{"$f":"'Soil physical'!B6","v":"Sand_1"},{"$f":"'Soil physical'!C6","v":"Sand proportion Layer 1 (%)"},{"$f":"'Soil physical'!D6","v":"Value"},{"$f":"'Soil physical'!E6","v":"-"},{"$f":"'Soil physical'!F6","v":{"v":35,"d":"35.0"}},{"$f":"'Soil physical'!G6","v":{"v":56.75,"d":"56.8"}},{"$f":"'Soil physical'!H6","v":{"v":35,"d":"35.0"}},{"$f":"'Soil physical'!I6","v":{"v":35,"d":"35.0"}},{"$f":"'Soil physical'!J6","v":{"v":35,"d":"35.0"}},{"$f":"'Soil physical'!K6","v":{"v":35,"d":"35.0"}},{"$f":"'Soil physical'!L6","v":"-"},{"$f":"'Soil physical'!M6","v":"-"},{"$f":"'Soil physical'!N6","v":"-"},{"$f":"'Soil physical'!O6","v":"-"},{"$f":"'Soil physical'!P6","v":"-"},{"$f":"'Soil physical'!Q6","v":"-"},{"$f":"'Soil physical'!R6","v":"-"},{"$f":"'Soil physical'!S6","v":"-"},{"$f":"'Soil physical'!T6","v":"-"},{"$f":"'Soil physical'!U6","v":"-"},{"$f":"'Soil physical'!V6","v":"-"},{"$f":"'Soil physical'!W6","v":"-"},{"$f":"'Soil physical'!X6","v":"-"},{"$f":"'Soil physical'!Y6","v":"-"}]
[{"$f":"'Soil physical'!A7","v":8},{"$f":"'Soil physical'!B7","v":"Sand_2"},{"$f":"'Soil physical'!C7","v":"Sand proportion Layer 2 (%)"},{"$f":"'Soil physical'!D7","v":"Value"},{"$f":"'Soil physical'!E7","v":"-"},{"$f":"'Soil physical'!F7","v":{"v":35,"d":"35.0"}},{"$f":"'Soil physical'!G7","v":{"v":59,"d":"59.0"}},{"$f":"'Soil physical'!H7","v":{"v":35,"d":"35.0"}},{"$f":"'Soil physical'!I7","v":{"v":35,"d":"35.0"}},{"$f":"'Soil physical'!J7","v":{"v":35,"d":"35.0"}},{"$f":"'Soil physical'!K7","v":{"v":35,"d":"35.0"}},{"$f":"'Soil physical'!L7","v":"-"},{"$f":"'Soil physical'!M7","v":"-"},{"$f":"'Soil physical'!N7","v":"-"},{"$f":"'Soil physical'!O7","v":"-"},{"$f":"'Soil physical'!P7","v":"-"},{"$f":"'Soil physical'!Q7","v":"-"},{"$f":"'Soil physical'!R7","v":"-"},{"$f":"'Soil physical'!S7","v":"-"},{"$f":"'Soil physical'!T7","v":"-"},{"$f":"'Soil physical'!U7","v":"-"},{"$f":"'Soil physical'!V7","v":"-"},{"$f":"'Soil physical'!W7","v":"-"},{"$f":"'Soil physical'!X7","v":"-"},{"$f":"'Soil physical'!Y7","v":"-"}]
[{"$f":"'Soil physical'!A8","v":0},{"$f":"'Soil physical'!B8","v":"Stone"}]
[{"$f":"'Soil physical'!A9","v":9},{"$f":"'Soil physical'!B9","v":"Stone_content_1"},{"$f":"'Soil physical'!C9","v":"Stone proportion Layer 1 (%)"},{"$f":"'Soil physical'!D9","v":"Value"},{"$f":"'Soil physical'!E9","v":"-"},{"$f":"'Soil physical'!F9","v":"-"},{"$f":"'Soil physical'!G9","v":"-"},{"$f":"'Soil physical'!H9","v":"-"},{"$f":"'Soil physical'!I9","v":"-"},{"$f":"'Soil physical'!J9","v":"-"},{"$f":"'Soil physical'!K9","v":"-"},{"$f":"'Soil physical'!L9","v":"-"},{"$f":"'Soil physical'!M9","v":"-"},{"$f":"'Soil physical'!N9","v":"-"},{"$f":"'Soil physical'!O9","v":"-"},{"$f":"'Soil physical'!P9","v":"-"},{"$f":"'Soil physical'!Q9","v":"-"},{"$f":"'Soil physical'!R9","v":"-"},{"$f":"'Soil physical'!S9","v":"-"},{"$f":"'Soil physical'!T9","v":"-"},{"$f":"'Soil physical'!U9","v":"-"},{"$f":"'Soil physical'!V9","v":"-"},{"$f":"'Soil physical'!W9","v":"-"},{"$f":"'Soil physical'!X9","v":"-"},{"$f":"'Soil physical'!Y9","v":"-"}]
[{"$f":"'Soil physical'!A10","v":10},{"$f":"'Soil physical'!B10","v":"Stone_content_2"},{"$f":"'Soil physical'!C10","v":"Stone proportion Layer 2 (%)"},{"$f":"'Soil physical'!D10","v":"Value"},{"$f":"'Soil physical'!E10","v":"-"},{"$f":"'Soil physical'!F10","v":"-"},{"$f":"'Soil physical'!G10","v":"-"},{"$f":"'Soil physical'!H10","v":"-"},{"$f":"'Soil physical'!I10","v":"-"},{"$f":"'Soil physical'!J10","v":"-"},{"$f":"'Soil physical'!K10","v":"-"},{"$f":"'Soil physical'!L10","v":"-"},{"$f":"'Soil physical'!M10","v":"-"},{"$f":"'Soil physical'!N10","v":"-"},{"$f":"'Soil physical'!O10","v":"-"},{"$f":"'Soil physical'!P10","v":"-"},{"$f":"'Soil physical'!Q10","v":"-"},{"$f":"'Soil physical'!R10","v":"-"},{"$f":"'Soil physical'!S10","v":"-"},{"$f":"'Soil physical'!T10","v":"-"},{"$f":"'Soil physical'!U10","v":"-"},{"$f":"'Soil physical'!V10","v":"-"},{"$f":"'Soil physical'!W10","v":"-"},{"$f":"'Soil physical'!X10","v":"-"},{"$f":"'Soil physical'!Y10","v":"-"}]
[{"$f":"'Soil physical'!A11","v":0},{"$f":"'Soil physical'!B11","v":"Bulk density"}]
[{"$f":"'Soil physical'!A12","v":1},{"$f":"'Soil physical'!B12","v":"Bulk_density_1"},{"$f":"'Soil physical'!C12","v":"Bulk Density Layer 1 (ton/m3)"},{"$f":"'Soil physical'!D12","v":"Value"},{"$f":"'Soil physical'!E12","v":"-"},{"$f":"'Soil physical'!F12","v":1.5},{"$f":"'Soil physical'!G12","v":1.4275},{"$f":"'Soil physical'!H12","v":1.5},{"$f":"'Soil physical'!I12","v":1.5},{"$f":"'Soil physical'!J12","v":1.5},{"$f":"'Soil physical'!K12","v":1.5},{"$f":"'Soil physical'!L12","v":"-"},{"$f":"'Soil physical'!M12","v":"-"},{"$f":"'Soil physical'!N12","v":"-"},{"$f":"'Soil physical'!O12","v":"-"},{"$f":"'Soil physical'!P12","v":"-"},{"$f":"'Soil physical'!Q12","v":"-"},{"$f":"'Soil physical'!R12","v":"-"},{"$f":"'Soil physical'!S12","v":"-"},{"$f":"'Soil physical'!T12","v":"-"},{"$f":"'Soil physical'!U12","v":"-"},{"$f":"'Soil physical'!V12","v":"-"},{"$f":"'Soil physical'!W12","v":"-"},{"$f":"'Soil physical'!X12","v":"-"},{"$f":"'Soil physical'!Y12","v":"-"}]
[{"$f":"'Soil physical'!A13","v":2},{"$f":"'Soil physical'!B13","v":"Bulk_density_2"},{"$f":"'Soil physical'!C13","v":"Bulk Density Layer 2 (ton/m3)"},{"$f":"'Soil physical'!D13","v":"Value"},{"$f":"'Soil physical'!E13","v":"-"},{"$f":"'Soil physical'!F13","v":1.5},{"$f":"'Soil physical'!G13","v":1.45},{"$f":"'Soil physical'!H13","v":1.5},{"$f":"'Soil physical'!I13","v":1.5},{"$f":"'Soil physical'!J13","v":1.5},{"$f":"'Soil physical'!K13","v":1.5},{"$f":"'Soil physical'!L13","v":"-"},{"$f":"'Soil physical'!M13","v":"-"},{"$f":"'Soil physical'!N13","v":"-"},{"$f":"'Soil physical'!O13","v":"-"},{"$f":"'Soil physical'!P13","v":"-"},{"$f":"'Soil physical'!Q13","v":"-"},{"$f":"'Soil physical'!R13","v":"-"},{"$f":"'Soil physical'!S13","v":"-"},{"$f":"'Soil physical'!T13","v":"-"},{"$f":"'Soil physical'!U13","v":"-"},{"$f":"'Soil physical'!V13","v":"-"},{"$f":"'Soil physical'!W13","v":"-"},{"$f":"'Soil physical'!X13","v":"-"},{"$f":"'Soil physical'!Y13","v":"-"}]
[{"$f":"'Soil physical'!A14","v":0},{"$f":"'Soil physical'!B14","v":"Soil depth"}]
[{"$f":"'Soil physical'!A15","v":5},{"$f":"'Soil physical'!B15","v":"Depth_to_L2"},{"$f":"'Soil physical'!C15","v":"Depth of Layer 1 (Topsoil) (cm)"},{"$f":"'Soil physical'!D15","v":"Value"},{"$f":"'Soil physical'!E15","v":"-"},{"$f":"'Soil physical'!F15","v":10},{"$f":"'Soil physical'!G15","v":50},{"$f":"'Soil physical'!H15","v":20},{"$f":"'Soil physical'!I15","v":10},{"$f":"'Soil physical'!J15","v":20},{"$f":"'Soil physical'!K15","v":10},{"$f":"'Soil physical'!L15","v":"-"},{"$f":"'Soil physical'!M15","v":"-"},{"$f":"'Soil physical'!N15","v":"-"},{"$f":"'Soil physical'!O15","v":"-"},{"$f":"'Soil physical'!P15","v":"-"},{"$f":"'Soil physical'!Q15","v":"-"},{"$f":"'Soil physical'!R15","v":"-"},{"$f":"'Soil physical'!S15","v":"-"},{"$f":"'Soil physical'!T15","v":"-"},{"$f":"'Soil physical'!U15","v":"-"},{"$f":"'Soil physical'!V15","v":"-"},{"$f":"'Soil physical'!W15","v":"-"},{"$f":"'Soil physical'!X15","v":"-"},{"$f":"'Soil physical'!Y15","v":"-"}]
[{"$f":"'Soil physical'!A16","v":6},{"$f":"'Soil physical'!B16","v":"Depth_to_L3"},{"$f":"'Soil physical'!C16","v":"Depth of Layer 2 (Subsoil) (cm)"},{"$f":"'Soil physical'!D16","v":"Value"},{"$f":"'Soil physical'!E16","v":"-"},{"$f":"'Soil physical'!F16","v":50},{"$f":"'Soil physical'!G16","v":50},{"$f":"'Soil physical'!H16","v":35},{"$f":"'Soil physical'!I16","v":20},{"$f":"'Soil physical'!J16","v":35},{"$f":"'Soil physical'!K16","v":20},{"$f":"'Soil physical'!L16","v":"-"},{"$f":"'Soil physical'!M16","v":"-"},{"$f":"'Soil physical'!N16","v":"-"},{"$f":"'Soil physical'!O16","v":"-"},{"$f":"'Soil physical'!P16","v":"-"},{"$f":"'Soil physical'!Q16","v":"-"},{"$f":"'Soil physical'!R16","v":"-"},{"$f":"'Soil physical'!S16","v":"-"},{"$f":"'Soil physical'!T16","v":"-"},{"$f":"'Soil physical'!U16","v":"-"},{"$f":"'Soil physical'!V16","v":"-"},{"$f":"'Soil physical'!W16","v":"-"},{"$f":"'Soil physical'!X16","v":"-"},{"$f":"'Soil physical'!Y16","v":"-"}]
[null,"Vegetation"]
[{"$f":"Vegetation!A2","v":0},{"$f":"Vegetation!B2","v":"Soil condition"}]
[{"$f":"Vegetation!A3","v":1},{"$f":"Vegetation!B3","v":"Soil_Nutrient_Status"},{"$f":"Vegetation!C3","v":"Topsoil nutrient status"},{"$f":"Vegetation!D3","v":"Class"},{"$f":"Vegetation!E3","v":"-"},{"$f":"Vegetation!F3","v":"Low"},{"$f":"Vegetation!G3","v":"Moderate"},{"$f":"Vegetation!H3","v":"High"},{"$f":"Vegetation!I3","v":"High"},{"$f":"Vegetation!J3","v":"High"},{"$f":"Vegetation!K3","v":"High"},{"$f":"Vegetation!L3","v":"-"},{"$f":"Vegetation!M3","v":"-"},{"$f":"Vegetation!N3","v":"-"},{"$f":"Vegetation!O3","v":"-"},{"$f":"Vegetation!P3","v":"-"},{"$f":"Vegetation!Q3","v":"-"},{"$f":"Vegetation!R3","v":"-"},{"$f":"Vegetation!S3","v":"-"},{"$f":"Vegetation!T3","v":"-"},{"$f":"Vegetation!U3","v":"-"},{"$f":"Vegetation!V3","v":"-"},{"$f":"Vegetation!W3","v":"-"},{"$f":"Vegetation!X3","v":"-"},{"$f":"Vegetation!Y3","v":"-"}]
[{"$f":"Vegetation!A4","v":2},{"$f":"Vegetation!B4","v":"Topsoil_organic_matter"},{"$f":"Vegetation!C4","v":"Topsoil organic matter"},{"$f":"Vegetation!D4","v":"Class"},{"$f":"Vegetation!E4","v":"Calculated by model.  Optional input"},{"$f":"Vegetation!F4","v":"Low"},{"$f":"Vegetation!G4","v":"Low"},{"$f":"Vegetation!H4","v":"Medium"},{"$f":"Vegetation!I4","v":"High"},{"$f":"Vegetation!J4","v":"High"},{"$f":"Vegetation!K4","v":"High"},{"$f":"Vegetation!L4","v":"-"},{"$f":"Vegetation!M4","v":"-"},{"$f":"Vegetation!N4","v":"-"},{"$f":"Vegetation!O4","v":"-"},{"$f":"Vegetation!P4","v":"-"},{"$f":"Vegetation!Q4","v":"-"},{"$f":"Vegetation!R4","v":"-"},{"$f":"Vegetation!S4","v":"-"},{"$f":"Vegetation!T4","v":"-"},{"$f":"Vegetation!U4","v":"-"},{"$f":"Vegetation!V4","v":"-"},{"$f":"Vegetation!W4","v":"-"},{"$f":"Vegetation!X4","v":"-"},{"$f":"Vegetation!Y4","v":"-"}]
[{"$f":"Vegetation!A5","v":0},{"$f":"Vegetation!B5","v":"Vegetation cover"}]
[{"$f":"Vegetation!A6","v":3},{"$f":"Vegetation!B6","v":"Annual_spp_groundcover"},{"$f":"Vegetation!C6","v":"Annual species cover (%)"},{"$f":"Vegetation!D6","v":"Value"},{"$f":"Vegetation!E6","v":"Calculated by model.  Optional input"},{"$f":"Vegetation!F6","v":{"v":0,"d":"0.0"}},{"$f":"Vegetation!G6","v":{"v":0,"d":"0.0"}},{"$f":"Vegetation!H6","v":{"v":79,"d":"79.0"}},{"$f":"Vegetation!I6","v":{"v":79,"d":"79.0"}},{"$f":"Vegetation!J6","v":{"v":79,"d":"79.0"}},{"$f":"Vegetation!K6","v":{"v":79,"d":"79.0"}},{"$f":"Vegetation!L6","v":{"v":0,"d":"0.0"}},{"$f":"Vegetation!M6","v":"-"},{"$f":"Vegetation!N6","v":"-"},{"$f":"Vegetation!O6","v":"-"},{"$f":"Vegetation!P6","v":"-"},{"$f":"Vegetation!Q6","v":"-"},{"$f":"Vegetation!R6","v":"-"},{"$f":"Vegetation!S6","v":"-"},{"$f":"Vegetation!T6","v":"-"},{"$f":"Vegetation!U6","v":"-"},{"$f":"Vegetation!V6","v":"-"},{"$f":"Vegetation!W6","v":"-"},{"$f":"Vegetation!X6","v":"-"},{"$f":"Vegetation!Y6","v":"-"}]
[{"$f":"Vegetation!A7","v":4},{"$f":"Vegetation!B7","v":"Perennial_spp_groundcover"},{"$f":"Vegetation!C7","v":"Perennial species cover (%)"},{"$f":"Vegetation!D7","v":"Value"},{"$f":"Vegetation!E7","v":"Calculated by model.  Optional input"},{"$f":"Vegetation!F7","v":{"v":0,"d":"0.0"}},{"$f":"Vegetation!G7","v":{"v":42.54752051920926,"d":"42.5"}},{"$f":"Vegetation!H7","v":{"v":79,"d":"79.0"}},{"$f":"Vegetation!I7","v":{"v":79,"d":"79.0"}},{"$f":"Vegetation!J7","v":{"v":79,"d":"79.0"}},{"$f":"Vegetation!K7","v":{"v":79,"d":"79.0"}},{"$f":"Vegetation!L7","v":"-"},{"$f":"Vegetation!M7","v":"-"},{"$f":"Vegetation!N7","v":"-"},{"$f":"Vegetation!O7","v":"-"},{"$f":"Vegetation!P7","v":"-"},{"$f":"Vegetation!Q7","v":"-"},{"$f":"Vegetation!R7","v":"-"},{"$f":"Vegetation!S7","v":"-"},{"$f":"Vegetation!T7","v":"-"},{"$f":"Vegetation!U7","v":"-"},{"$f":"Vegetation!V7","v":"-"},{"$f":"Vegetation!W7","v":"-"},{"$f":"Vegetation!X7","v":"-"},{"$f":"Vegetation!Y7","v":"-"}]
[{"$f":"Vegetation!A8","v":6},{"$f":"Vegetation!B8","v":"Woody_spp_cover"},{"$f":"Vegetation!C8","v":"Woody species cover (%)"},{"$f":"Vegetation!D8","v":"Value"},{"$f":"Vegetation!E8","v":"Calculated by model.  Optional input"},{"$f":"Vegetation!F8","v":{"v":0,"d":"0.0"}},{"$f":"Vegetation!G8","v":{"v":0,"d":"0.0"}},{"$f":"Vegetation!H8","v":{"v":0,"d":"0.0"}},{"$f":"Vegetation!I8","v":{"v":0,"d":"0.0"}},{"$f":"Vegetation!J8","v":{"v":0,"d":"0.0"}},{"$f":"Vegetation!K8","v":{"v":0,"d":"0.0"}},{"$f":"Vegetation!L8","v":"-"},{"$f":"Vegetation!M8","v":"-"},{"$f":"Vegetation!N8","v":"-"},{"$f":"Vegetation!O8","v":"-"},{"$f":"Vegetation!P8","v":"-"},{"$f":"Vegetation!Q8","v":"-"},{"$f":"Vegetation!R8","v":"-"},{"$f":"Vegetation!S8","v":"-"},{"$f":"Vegetation!T8","v":"-"},{"$f":"Vegetation!U8","v":"-"},{"$f":"Vegetation!V8","v":"-"},{"$f":"Vegetation!W8","v":"-"},{"$f":"Vegetation!X8","v":"-"},{"$f":"Vegetation!Y8","v":"-"}]
[{"$f":"Vegetation!A9","v":5},{"$f":"Vegetation!B9","v":"Vegetation_cover"},{"$f":"Vegetation!C9","v":"Total vegetation cover (%)"},{"$f":"Vegetation!D9","v":"Value"},{"$f":"Vegetation!E9","v":"Calculated by model.  Optional input"},{"$f":"Vegetation!F9","v":{"v":0,"d":"0.0"}},{"$f":"Vegetation!G9","v":{"v":42.54752051920926,"d":"42.5"}},{"$f":"Vegetation!H9","v":{"v":79,"d":"79.0"}},{"$f":"Vegetation!I9","v":{"v":79,"d":"79.0"}},{"$f":"Vegetation!J9","v":{"v":79,"d":"79.0"}},{"$f":"Vegetation!K9","v":{"v":79,"d":"79.0"}},{"$f":"Vegetation!L9","v":"-"},{"$f":"Vegetation!M9","v":"-"},{"$f":"Vegetation!N9","v":"-"},{"$f":"Vegetation!O9","v":"-"},{"$f":"Vegetation!P9","v":"-"},{"$f":"Vegetation!Q9","v":"-"},{"$f":"Vegetation!R9","v":"-"},{"$f":"Vegetation!S9","v":"-"},{"$f":"Vegetation!T9","v":"-"},{"$f":"Vegetation!U9","v":"-"},{"$f":"Vegetation!V9","v":"-"},{"$f":"Vegetation!W9","v":"-"},{"$f":"Vegetation!X9","v":"-"},{"$f":"Vegetation!Y9","v":"-"}]

{"sheet":"Data Form","index":13,"n_rows":21,"n_cols":67,"rows_kept":21}
[{"$f":"Scenarios!A2","v":"Scenario number"},{"$f":"Scenarios!B2","v":"Climate Description"},{"$f":"Scenarios!C2","v":"Scenario Description"},{"$f":"'Climate Assumptions'!B4","v":"Avge_annual_rainfall"},{"$f":"'Climate Assumptions'!B5","v":"Rainfall_IFD_index"},{"$f":"'Climate Assumptions'!B9","v":"CumulativeRainfall_2month"},{"$f":"Interventions!$B3","v":"Spoil_amendment_rate_1"},{"$f":"Interventions!$B4","v":"Spoil_amendment_rate_2"},{"$f":"Interventions!$B5","v":"Spoil_amendment_rate_3"},{"$f":"Interventions!$B7","v":"Spoil_amendment_type_1"},{"$f":"Interventions!$B8","v":"Spoil_amendment_type_2"},{"$f":"Interventions!$B9","v":"Spoil_amendment_type_3"},{"$f":"Interventions!$B11","v":"Amendment_form_1"},{"$f":"Interventions!$B12","v":"Amendment_form_2"},{"$f":"Interventions!$B13","v":"Amendment_form_3"},{"$f":"Interventions!$B15","v":"Spoil_amendment_application_1"},{"$f":"Interventions!$B17","v":"Contourbank_height"},{"$f":"Interventions!$B18","v":"Contourbank_Interval"},{"$f":"Interventions!$B19","v":"Contourbank_permanence"},{"$f":"Interventions!$B20","v":"UpslopeBund"},{"$f":"Interventions!$B22","v":"Slope_angle"},{"$f":"Interventions!$B23","v":"Overall_Slope_length"},{"$f":"Interventions!$B24","v":"Slope_shape"},{"$f":"Interventions!$B25","v":"Lateral_landform_uniformity"},{"$f":"Interventions!$B26","v":"Slope_Drainage_Type"},{"$f":"Interventions!$B28","v":"Rip_depth"},{"$f":"Interventions!$B29","v":"Rip_direction"},{"$f":"Interventions!$B30","v":"Rip_conditions"},{"$f":"Interventions!$B32","v":"Mixing_topsoil_rockmulch"},{"$f":"Interventions!$B33","v":"Surface_armouring_quantity"},{"$f":"Interventions!$B34","v":"Surface_roughness_noVeg"},{"$f":"Interventions!$B36","v":"ERA_landuse_designation"},{"$f":"Interventions!$B37","v":"Seed_Addition"},{"$f":"Interventions!$B38","v":"Fertiliser_addition"},{"$f":"Interventions!$B39","v":"Organic_mulch"},{"$f":"Interventions!$B40","v":"Irrigation"},{"$f":"'Soil Chemical'!$B3","v":"pH_1"},{"$f":"'Soil Chemical'!$B4","v":"pH_2"},{"$f":"'Soil Chemical'!$B5","v":"pH_3"},{"$f":"'Soil Chemical'!$B7","v":"EC_1"},{"$f":"'Soil Chemical'!$B8","v":"EC_2"},{"$f":"'Soil Chemical'!$B9","v":"EC_3"},{"$f":"'Soil Chemical'!$B11","v":"Na_ex_1"},{"$f":"'Soil Chemical'!$B12","v":"Na_ex_2"},{"$f":"'Soil Chemical'!$B13","v":"Na_ex_3"},{"$f":"'Soil Chemical'!$B15","v":"K_ex_1"},{"$f":"'Soil Chemical'!$B16","v":"K_ex_2"},{"$f":"'Soil Chemical'!$B17","v":"K_ex_3"},{"$f":"'Soil Chemical'!$B19","v":"EDP_1"},{"$f":"'Soil Chemical'!$B20","v":"EDP_2"},{"$f":"'Soil Chemical'!$B21","v":"EDP_3"},{"$f":"'Soil physical'!$B3","v":"Clay_1"},{"$f":"'Soil physical'!$B4","v":"Clay_2"},{"$f":"'Soil physical'!$B6","v":"Sand_1"},{"$f":"'Soil physical'!$B7","v":"Sand_2"},{"$f":"'Soil physical'!$B9","v":"Stone_content_1"},{"$f":"'Soil physical'!$B10","v":"Stone_content_2"},{"$f":"'Soil physical'!$B12","v":"Bulk_density_1"},{"$f":"'Soil physical'!$B13","v":"Bulk_density_2"},{"$f":"'Soil physical'!$B15","v":"Depth_to_L2"},{"$f":"'Soil physical'!$B16","v":"Depth_to_L3"},{"$f":"Vegetation!$B3","v":"Soil_Nutrient_Status"},{"$f":"Vegetation!$B4","v":"Topsoil_organic_matter"},{"$f":"Vegetation!$B6","v":"Annual_spp_groundcover"},{"$f":"Vegetation!$B7","v":"Perennial_spp_groundcover"},{"$f":"Vegetation!$B8","v":"Woody_spp_cover"},{"$f":"Vegetation!$B9","v":"Vegetation_cover"}]
[{"$f":"Scenarios!A3","v":"Scenario 01: "},{"$f":"Scenarios!B3","v":"Average Year"},{"$f":"Scenarios!C3","v":"1. Pre-amendment"},{"$f":"'Climate Assumptions'!$F4","v":606.978996424921},{"$f":"'Climate Assumptions'!$F5","v":"High"},{"$f":"'Climate Assumptions'!$F9","v":{"v":156.67302093973348,"d":"156.7"}},{"$f":"Interventions!$F3","v":"Nil"},{"$f":"Interventions!$F4","v":"Nil"},{"$f":"Interventions!$F5","v":"Nil"},{"$f":"Interventions!$F7","v":"-"},{"$f":"Interventions!$F8","v":"-"},{"$f":"Interventions!$F9","v":"-"},{"$f":"Interventions!$F11","v":"-"},{"$f":"Interventions!$F12","v":"-"},{"$f":"Interventions!$F13","v":"-"},{"$f":"Interventions!$F15","v":"-"},{"$f":"Interventions!$F17","v":500},{"$f":"Interventions!$F18","v":20},{"$f":"Interventions!$F19","v":"Temporary"},{"$f":"Interventions!$F20","v":"Yes"},{"$f":"Interventions!$F22","v":10},{"$f":"Interventions!$F23","v":100},{"$f":"Interventions!$F24","v":"Linear"},{"$f":"Interventions!$F25","v":"Flat_linear"},{"$f":"Interventions!$F26","v":"Grassed_drains"},{"$f":"Interventions!$F28","v":50},{"$f":"Interventions!$F29","v":"Grade_ripped_downslope"},{"$f":"Interventions!$F30","v":"Moist"},{"$f":"Interventions!$F32","v":"No"},{"$f":"Interventions!$F33","v":0},{"$f":"Interventions!$F34","v":5},{"$f":"Interventions!$F36","v":"Native_vegetation"},{"$f":"Interventions!$F37","v":"None"},{"$f":"Interventions!$F38","v":"No"},{"$f":"Interventions!$F39","v":0},{"$f":"Interventions!$F40","v":"No"},{"$f":"'Soil Chemical'!$F3","v":5.7},{"$f":"'Soil Chemical'!$F4","v":5.7},{"$f":"'Soil Chemical'!$F$5","v":"-"},{"$f":"'Soil Chemical'!$F7","v":{"v":0.7,"d":"0.70"}},{"$f":"'Soil Chemical'!$F8","v":{"v":0.7,"d":"0.70"}},{"$f":"'Soil Chemical'!$F9","v":{"v":0.7,"d":"0.70"}},{"$f":"'Soil Chemical'!$F11","v":{"v":5,"d":"5.00"}},{"$f":"'Soil Chemical'!$F12","v":{"v":5,"d":"5.00"}},{"$f":"'Soil Chemical'!$F13","v":{"v":5,"d":"5.00"}},{"$f":"'Soil Chemical'!$F15","v":{"v":0.3,"d":"0.30"}},{"$f":"'Soil Chemical'!$F16","v":{"v":0.3,"d":"0.30"}},{"$f":"'Soil Chemical'!$F17","v":{"v":0.3,"d":"0.30"}},{"$f":"'Soil Chemical'!$F19","v":{"v":35.8,"d":"35.80"}},{"$f":"'Soil Chemical'!$F20","v":{"v":35.8,"d":"35.80"}},{"$f":"'Soil Chemical'!$F21","v":{"v":35.8,"d":"35.80"}},{"$f":"'Soil physical'!$F3","v":35.5},{"$f":"'Soil physical'!$F4","v":35.5},{"$f":"'Soil physical'!$F6","v":{"v":35,"d":"35.0"}},{"$f":"'Soil physical'!$F7","v":{"v":35,"d":"35.0"}},{"$f":"'Soil physical'!$F9","v":"-"},{"$f":"'Soil physical'!$F10","v":"-"},{"$f":"'Soil physical'!$F12","v":1.5},{"$f":"'Soil physical'!$F13","v":1.5},{"$f":"'Soil physical'!$F15","v":10},{"$f":"'Soil physical'!$F16","v":50},{"$f":"Vegetation!$F3","v":"Low"},{"$f":"Vegetation!$F4","v":"Low"},{"$f":"Vegetation!$F6","v":{"v":0,"d":"0.0"}},{"$f":"Vegetation!$F7","v":{"v":0,"d":"0.0"}},{"$f":"Vegetation!$F8","v":{"v":0,"d":"0.0"}},{"$f":"Vegetation!$F9","v":{"v":0,"d":"0.0"}}]
[{"$f":"Scenarios!A4","v":"Scenario 02: "},{"$f":"Scenarios!B4","v":"Average Year"},{"$f":"Scenarios!C4","v":"2. Rock mulch treatment"},{"$f":"'Climate Assumptions'!$G4","v":606.978996424921},{"$f":"'Climate Assumptions'!$G5","v":"High"},{"$f":"'Climate Assumptions'!$G9","v":{"v":184.38581460673998,"d":"184.4"}},{"$f":"Interventions!$G3","v":"Nil"},{"$f":"Interventions!$G4","v":"Nil"},{"$f":"Interventions!$G5","v":"Nil"},{"$f":"Interventions!$G7","v":"Gypsum"},{"$f":"Interventions!$G8","v":"Gypsum"},{"$f":"Interventions!$G9","v":"Gypsum"},{"$f":"Interventions!$G11","v":"Granular"},{"$f":"Interventions!$G12","v":"Granular"},{"$f":"Interventions!$G13","v":"Granular"},{"$f":"Interventions!$G15","v":"Incorporated"},{"$f":"Interventions!$G17","v":0},{"$f":"Interventions!$G18","v":20},{"$f":"Interventions!$G19","v":"Temporary"},{"$f":"Interventions!$G20","v":"Yes"},{"$f":"Interventions!$G22","v":10},{"$f":"Interventions!$G23","v":100},{"$f":"Interventions!$G24","v":"Linear"},{"$f":"Interventions!$G25","v":"Flat_linear"},{"$f":"Interventions!$G26","v":"No_drainage"},{"$f":"Interventions!$G28","v":50},{"$f":"Interventions!$G29","v":"Contour_ripped"},{"$f":"Interventions!$G30","v":"Dry"},{"$f":"Interventions!$G32","v":"Yes"},{"$f":"Interventions!$G33","v":100},{"$f":"Interventions!$G34","v":50},{"$f":"Interventions!$G36","v":"Grazing"},{"$f":"Interventions!$G37","v":"Mixed_Pasture_Covercrop_Spp"},{"$f":"Interventions!$G38","v":"Yes"},{"$f":"Interventions!$G39","v":0},{"$f":"Interventions!$G40","v":"No"},{"$f":"'Soil Chemical'!$G3","v":5.7},{"$f":"'Soil Chemical'!$F4","v":5.7},{"$f":"'Soil Chemical'!$G$5","v":"-"},{"$f":"'Soil Chemical'!$F7","v":{"v":0.7,"d":"0.70"}},{"$f":"'Soil Chemical'!$F8","v":{"v":0.7,"d":"0.70"}},{"$f":"'Soil Chemical'!$F9","v":{"v":0.7,"d":"0.70"}},{"$f":"'Soil Chemical'!$F11","v":{"v":5,"d":"5.00"}},{"$f":"'Soil Chemical'!$F12","v":{"v":5,"d":"5.00"}},{"$f":"'Soil Chemical'!$F13","v":{"v":5,"d":"5.00"}},{"$f":"'Soil Chemical'!$F15","v":{"v":0.3,"d":"0.30"}},{"$f":"'Soil Chemical'!$F16","v":{"v":0.3,"d":"0.30"}},{"$f":"'Soil Chemical'!$F17","v":{"v":0.3,"d":"0.30"}},{"$f":"'Soil Chemical'!$F19","v":{"v":35.8,"d":"35.80"}},{"$f":"'Soil Chemical'!$F20","v":{"v":35.8,"d":"35.80"}},{"$f":"'Soil Chemical'!$F21","v":{"v":35.8,"d":"35.80"}},{"$f":"'Soil physical'!$G3","v":{"v":9.75,"d":"9.8"}},{"$f":"'Soil physical'!$G4","v":{"v":8.25,"d":"8.3"}},{"$f":"'Soil physical'!$G6","v":{"v":56.75,"d":"56.8"}},{"$f":"'Soil physical'!$G7","v":{"v":59,"d":"59.0"}},{"$f":"'Soil physical'!$G9","v":"-"},{"$f":"'Soil physical'!$G10","v":"-"},{"$f":"'Soil physical'!$G12","v":{"v":1.4275,"d":"1.4"}},{"$f":"'Soil physical'!$G13","v":{"v":1.45,"d":"1.5"}},{"$f":"'Soil physical'!$G15","v":50},{"$f":"'Soil physical'!$G16","v":50},{"$f":"Vegetation!$G3","v":"Moderate"},{"$f":"Vegetation!$G4","v":"Low"},{"$f":"Vegetation!$G6","v":{"v":0,"d":"0.0"}},{"$f":"Vegetation!$G7","v":{"v":42.54752051920926,"d":"42.5"}},{"$f":"Vegetation!$G8","v":{"v":0,"d":"0.0"}},{"$f":"Vegetation!$G9","v":{"v":42.54752051920926,"d":"42.5"}}]
[{"$f":"Scenarios!A5","v":"Scenario 03: "},{"$f":"Scenarios!B5","v":"Average Year"},{"$f":"Scenarios!C5","v":"3. Post-amendment"},{"$f":"'Climate Assumptions'!$H4","v":606.978996424921},{"$f":"'Climate Assumptions'!$H5","v":"High"},{"$f":"'Climate Assumptions'!$H9","v":{"v":128.960227272727,"d":"129.0"}},{"$f":"Interventions!$H3","v":"As_Recommended"},{"$f":"Interventions!$H4","v":"As_Recommended"},{"$f":"Interventions!$H5","v":"As_Recommended"},{"$f":"Interventions!$H7","v":"Gypsum"},{"$f":"Interventions!$H8","v":"Gypsum"},{"$f":"Interventions!$H9","v":"Gypsum"},{"$f":"Interventions!$H11","v":"Granular"},{"$f":"Interventions!$H12","v":"Granular"},{"$f":"Interventions!$H13","v":"Granular"},{"$f":"Interventions!$H15","v":"Incorporated"},{"$f":"Interventions!$H17","v":500},{"$f":"Interventions!$H18","v":20},{"$f":"Interventions!$H19","v":"Temporary"},{"$f":"Interventions!$H20","v":"Yes"},{"$f":"Interventions!$H22","v":10},{"$f":"Interventions!$H23","v":100},{"$f":"Interventions!$H24","v":"Linear"},{"$f":"Interventions!$H25","v":"Flat_linear"},{"$f":"Interventions!$H26","v":"Grassed_drains"},{"$f":"Interventions!$H28","v":50},{"$f":"Interventions!$H29","v":"Grade_ripped_downslope"},{"$f":"Interventions!$H30","v":"Moist"},{"$f":"Interventions!$H32","v":"No"},{"$f":"Interventions!$H33","v":0},{"$f":"Interventions!$H34","v":10},{"$f":"Interventions!$H36","v":"Native_vegetation"},{"$f":"Interventions!$H37","v":"Mixed_Pasture_Covercrop_Spp"},{"$f":"Interventions!$H38","v":"Yes"},{"$f":"Interventions!$H39","v":5},{"$f":"Interventions!$H40","v":"Yes"},{"$f":"'Soil Chemical'!$H3","v":5.7},{"$f":"'Soil Chemical'!$H4","v":5.7},{"$f":"'Soil Chemical'!$H$5","v":"-"},{"$f":"'Soil Chemical'!$H7","v":0.28},{"$f":"'Soil Chemical'!$H8","v":0.34},{"$f":"'Soil Chemical'!$H9","v":0.34},{"$f":"'Soil Chemical'!$H11","v":{"v":0.3936605316973415,"d":"0.39"}},{"$f":"'Soil Chemical'!$H12","v":{"v":0.8650793650793652,"d":"0.87"}},{"$f":"'Soil Chemical'!$H13","v":{"v":0.8650793650793652,"d":"0.87"}},{"$f":"'Soil Chemical'!$H15","v":0.64},{"$f":"'Soil Chemical'!$H16","v":{"v":0.5,"d":"0.50"}},{"$f":"'Soil Chemical'!$H17","v":{"v":0.5,"d":"0.50"}},{"$f":"'Soil Chemical'!$H19","v":{"v":3,"d":"3.00"}},{"$f":"'Soil Chemical'!$H20","v":{"v":6,"d":"6.00"}},{"$f":"'Soil Chemical'!$H21","v":{"v":6,"d":"6.00"}},{"$f":"'Soil physical'!$H3","v":35.5},{"$f":"'Soil physical'!$H4","v":35.5},{"$f":"'Soil physical'!$H6","v":{"v":35,"d":"35.0"}},{"$f":"'Soil physical'!$H7","v":{"v":35,"d":"35.0"}},{"$f":"'Soil physical'!$H9","v":"-"},{"$f":"'Soil physical'!$H10","v":"-"},{"$f":"'Soil physical'!$H12","v":1.5},{"$f":"'Soil physical'!$H13","v":1.5},{"$f":"'Soil physical'!$H15","v":20},{"$f":"'Soil physical'!$H16","v":35},{"$f":"Vegetation!$H3","v":"High"},{"$f":"Vegetation!$H4","v":"Medium"},{"$f":"Vegetation!$H6","v":{"v":79,"d":"79.0"}},{"$f":"Vegetation!$H7","v":{"v":79,"d":"79.0"}},{"$f":"Vegetation!$H8","v":{"v":0,"d":"0.0"}},{"$f":"Vegetation!$H9","v":{"v":79,"d":"79.0"}}]
[{"$f":"Scenarios!A6","v":"Scenario 04: "},{"$f":"Scenarios!B6","v":"Average Year"},{"$f":"Scenarios!C6","v":"4. Post-amendment (Reduced treatment depth)"},{"$f":"'Climate Assumptions'!$I4","v":606.978996424921},{"$f":"'Climate Assumptions'!$I5","v":"High"},{"$f":"'Climate Assumptions'!$I9","v":{"v":128.960227272727,"d":"129.0"}},{"$f":"Interventions!$I3","v":"As_Recommended"},{"$f":"Interventions!$I4","v":"As_Recommended"},{"$f":"Interventions!$I5","v":"As_Recommended"},{"$f":"Interventions!$I7","v":"Gypsum"},{"$f":"Interventions!$I8","v":"Gypsum"},{"$f":"Interventions!$I9","v":"Gypsum"},{"$f":"Interventions!$I11","v":"Granular"},{"$f":"Interventions!$I12","v":"Granular"},{"$f":"Interventions!$I13","v":"Granular"},{"$f":"Interventions!$I15","v":"Incorporated"},{"$f":"Interventions!$I17","v":500},{"$f":"Interventions!$I18","v":20},{"$f":"Interventions!$I19","v":"Temporary"},{"$f":"Interventions!$I20","v":"Yes"},{"$f":"Interventions!$I22","v":10},{"$f":"Interventions!$I23","v":100},{"$f":"Interventions!$I24","v":"Linear"},{"$f":"Interventions!$I25","v":"Flat_linear"},{"$f":"Interventions!$I26","v":"Grassed_drains"},{"$f":"Interventions!$I28","v":50},{"$f":"Interventions!$I29","v":"Grade_ripped_downslope"},{"$f":"Interventions!$I30","v":"Moist"},{"$f":"Interventions!$I32","v":"No"},{"$f":"Interventions!$I33","v":0},{"$f":"Interventions!$I34","v":10},{"$f":"Interventions!$I36","v":"Native_vegetation"},{"$f":"Interventions!$I37","v":"Mixed_Pasture_Covercrop_Spp"},{"$f":"Interventions!$I38","v":"Yes"},{"$f":"Interventions!$I39","v":5},{"$f":"Interventions!$I40","v":"Yes"},{"$f":"'Soil Chemical'!$I3","v":5.7},{"$f":"'Soil Chemical'!$I4","v":5.7},{"$f":"'Soil Chemical'!$I$5","v":"-"},{"$f":"'Soil Chemical'!$I7","v":0.28},{"$f":"'Soil Chemical'!$I8","v":0.34},{"$f":"'Soil Chemical'!$I9","v":0.34},{"$f":"'Soil Chemical'!$I11","v":{"v":0.3936605316973415,"d":"0.39"}},{"$f":"'Soil Chemical'!$I12","v":{"v":0.8650793650793652,"d":"0.87"}},{"$f":"'Soil Chemical'!$I13","v":{"v":0.8650793650793652,"d":"0.87"}},{"$f":"'Soil Chemical'!$I15","v":0.64},{"$f":"'Soil Chemical'!$I16","v":{"v":0.5,"d":"0.50"}},{"$f":"'Soil Chemical'!$I17","v":{"v":0.5,"d":"0.50"}},{"$f":"'Soil Chemical'!$I19","v":{"v":3,"d":"3.00"}},{"$f":"'Soil Chemical'!$I20","v":{"v":6,"d":"6.00"}},{"$f":"'Soil Chemical'!$I21","v":{"v":6,"d":"6.00"}},{"$f":"'Soil physical'!$I3","v":35.5},{"$f":"'Soil physical'!$I4","v":35.5},{"$f":"'Soil physical'!$I6","v":{"v":35,"d":"35.0"}},{"$f":"'Soil physical'!$I7","v":{"v":35,"d":"35.0"}},{"$f":"'Soil physical'!$I9","v":"-"},{"$f":"'Soil physical'!$I10","v":"-"},{"$f":"'Soil physical'!$I12","v":1.5},{"$f":"'Soil physical'!$I13","v":1.5},{"$f":"'Soil physical'!$I15","v":10},{"$f":"'Soil physical'!$I16","v":20},{"$f":"Vegetation!$I3","v":"High"},{"$f":"Vegetation!$I4","v":"High"},{"$f":"Vegetation!$I6","v":{"v":79,"d":"79.0"}},{"$f":"Vegetation!$I7","v":{"v":79,"d":"79.0"}},{"$f":"Vegetation!$I8","v":{"v":0,"d":"0.0"}},{"$f":"Vegetation!$I9","v":{"v":79,"d":"79.0"}}]
[{"$f":"Scenarios!A7","v":"Scenario 05: "},{"$f":"Scenarios!B7","v":"Average Year"},{"$f":"Scenarios!C7","v":"5. Post-amendment (Reduced treatment ESP)"},{"$f":"'Climate Assumptions'!$J4","v":606.978996424921},{"$f":"'Climate Assumptions'!$J5","v":"High"},{"$f":"'Climate Assumptions'!$J9","v":{"v":128.960227272727,"d":"129.0"}},{"$f":"Interventions!$J3","v":"Half_recommended"},{"$f":"Interventions!$J4","v":"Half_recommended"},{"$f":"Interventions!$J5","v":"Half_recommended"},{"$f":"Interventions!$J7","v":"Gypsum"},{"$f":"Interventions!$J8","v":"Gypsum"},{"$f":"Interventions!$J9","v":"Gypsum"},{"$f":"Interventions!$J11","v":"Granular"},{"$f":"Interventions!$J12","v":"Granular"},{"$f":"Interventions!$J13","v":"Granular"},{"$f":"Interventions!$J15","v":"Incorporated"},{"$f":"Interventions!$J17","v":500},{"$f":"Interventions!$J18","v":20},{"$f":"Interventions!$J19","v":"Temporary"},{"$f":"Interventions!$J20","v":"Yes"},{"$f":"Interventions!$J22","v":10},{"$f":"Interventions!$J23","v":100},{"$f":"Interventions!$J24","v":"Linear"},{"$f":"Interventions!$J25","v":"Flat_linear"},{"$f":"Interventions!$J26","v":"Grassed_drains"},{"$f":"Interventions!$J28","v":50},{"$f":"Interventions!$J29","v":"Grade_ripped_downslope"},{"$f":"Interventions!$J30","v":"Moist"},{"$f":"Interventions!$J32","v":"No"},{"$f":"Interventions!$J33","v":0},{"$f":"Interventions!$J34","v":10},{"$f":"Interventions!$J36","v":"Native_vegetation"},{"$f":"Interventions!$J37","v":"Mixed_Pasture_Covercrop_Spp"},{"$f":"Interventions!$J38","v":"Yes"},{"$f":"Interventions!$J39","v":5},{"$f":"Interventions!$J40","v":"Yes"},{"$f":"'Soil Chemical'!$J3","v":5.7},{"$f":"'Soil Chemical'!$J4","v":5.7},{"$f":"'Soil Chemical'!$J$5","v":"-"},{"$f":"'Soil Chemical'!$J7","v":0.28},{"$f":"'Soil Chemical'!$J8","v":0.34},{"$f":"'Soil Chemical'!$J9","v":0.34},{"$f":"'Soil Chemical'!$J11","v":{"v":2,"d":"2.00"}},{"$f":"'Soil Chemical'!$J12","v":{"v":2,"d":"2.00"}},{"$f":"'Soil Chemical'!$J13","v":{"v":2,"d":"2.00"}},{"$f":"'Soil Chemical'!$J15","v":0.64},{"$f":"'Soil Chemical'!$J16","v":{"v":0.5,"d":"0.50"}},{"$f":"'Soil Chemical'!$J17","v":{"v":0.5,"d":"0.50"}},{"$f":"'Soil Chemical'!$J19","v":{"v":15,"d":"15.00"}},{"$f":"'Soil Chemical'!$J20","v":{"v":15,"d":"15.00"}},{"$f":"'Soil Chemical'!$J21","v":{"v":15,"d":"15.00"}},{"$f":"'Soil physical'!$J3","v":35.5},{"$f":"'Soil physical'!$J4","v":35.5},{"$f":"'Soil physical'!$J6","v":{"v":35,"d":"35.0"}},{"$f":"'Soil physical'!$J7","v":{"v":35,"d":"35.0"}},{"$f":"'Soil physical'!$J9","v":"-"},{"$f":"'Soil physical'!$J10","v":"-"},{"$f":"'Soil physical'!$J12","v":1.5},{"$f":"'Soil physical'!$J13","v":1.5},{"$f":"'Soil physical'!$J15","v":20},{"$f":"'Soil physical'!$J16","v":35},{"$f":"Vegetation!$J3","v":"High"},{"$f":"Vegetation!$J4","v":"High"},{"$f":"Vegetation!$J6","v":{"v":79,"d":"79.0"}},{"$f":"Vegetation!$J7","v":{"v":79,"d":"79.0"}},{"$f":"Vegetation!$J8","v":{"v":0,"d":"0.0"}},{"$f":"Vegetation!$J9","v":{"v":79,"d":"79.0"}}]
[{"$f":"Scenarios!A8","v":"Scenario 06: "},{"$f":"Scenarios!B8","v":"Average Year"},{"$f":"Scenarios!C8","v":"6. Post-amendment (Reduced treatment depth and ESP)"},{"$f":"'Climate Assumptions'!$K4","v":606.978996424921},{"$f":"'Climate Assumptions'!$K5","v":"High"},{"$f":"'Climate Assumptions'!$K9","v":{"v":128.960227272727,"d":"129.0"}},{"$f":"Interventions!$K3","v":"Half_recommended"},{"$f":"Interventions!$K4","v":"Half_recommended"},{"$f":"Interventions!$K5","v":"Half_recommended"},{"$f":"Interventions!$K7","v":"Gypsum"},{"$f":"Interventions!$K8","v":"Gypsum"},{"$f":"Interventions!$K9","v":"Gypsum"},{"$f":"Interventions!$K11","v":"Granular"},{"$f":"Interventions!$K12","v":"Granular"},{"$f":"Interventions!$K13","v":"Granular"},{"$f":"Interventions!$K15","v":"Incorporated"},{"$f":"Interventions!$K17","v":500},{"$f":"Interventions!$K18","v":20},{"$f":"Interventions!$K19","v":"Temporary"},{"$f":"Interventions!$K20","v":"Yes"},{"$f":"Interventions!$K22","v":10},{"$f":"Interventions!$K23","v":100},{"$f":"Interventions!$K24","v":"Linear"},{"$f":"Interventions!$K25","v":"Flat_linear"},{"$f":"Interventions!$K26","v":"Grassed_drains"},{"$f":"Interventions!$K28","v":50},{"$f":"Interventions!$K29","v":"Grade_ripped_downslope"},{"$f":"Interventions!$K30","v":"Moist"},{"$f":"Interventions!$K32","v":"No"},{"$f":"Interventions!$K33","v":0},{"$f":"Interventions!$K34","v":10},{"$f":"Interventions!$K36","v":"Native_vegetation"},{"$f":"Interventions!$K37","v":"Mixed_Pasture_Covercrop_Spp"},{"$f":"Interventions!$K38","v":"Yes"},{"$f":"Interventions!$K39","v":5},{"$f":"Interventions!$K40","v":"Yes"},{"$f":"'Soil Chemical'!$K3","v":5.7},{"$f":"'Soil Chemical'!$K4","v":5.7},{"$f":"'Soil Chemical'!$K$5","v":"-"},{"$f":"'Soil Chemical'!$K7","v":0.28},{"$f":"'Soil Chemical'!$K8","v":0.34},{"$f":"'Soil Chemical'!$K9","v":0.34},{"$f":"'Soil Chemical'!$K11","v":{"v":2,"d":"2.00"}},{"$f":"'Soil Chemical'!$K12","v":{"v":2,"d":"2.00"}},{"$f":"'Soil Chemical'!$K13","v":{"v":2,"d":"2.00"}},{"$f":"'Soil Chemical'!$K15","v":0.64},{"$f":"'Soil Chemical'!$K16","v":{"v":0.5,"d":"0.50"}},{"$f":"'Soil Chemical'!$K17","v":{"v":0.5,"d":"0.50"}},{"$f":"'Soil Chemical'!$K19","v":{"v":15,"d":"15.00"}},{"$f":"'Soil Chemical'!$K20","v":{"v":15,"d":"15.00"}},{"$f":"'Soil Chemical'!$K21","v":{"v":15,"d":"15.00"}},{"$f":"'Soil physical'!$K3","v":35.5},{"$f":"'Soil physical'!$K4","v":35.5},{"$f":"'Soil physical'!$K6","v":{"v":35,"d":"35.0"}},{"$f":"'Soil physical'!$K7","v":{"v":35,"d":"35.0"}},{"$f":"'Soil physical'!$K9","v":"-"},{"$f":"'Soil physical'!$K10","v":"-"},{"$f":"'Soil physical'!$K12","v":1.5},{"$f":"'Soil physical'!$K13","v":1.5},{"$f":"'Soil physical'!$K15","v":10},{"$f":"'Soil physical'!$K16","v":20},{"$f":"Vegetation!$K3","v":"High"},{"$f":"Vegetation!$K4","v":"High"},{"$f":"Vegetation!$K6","v":{"v":79,"d":"79.0"}},{"$f":"Vegetation!$K7","v":{"v":79,"d":"79.0"}},{"$f":"Vegetation!$K8","v":{"v":0,"d":"0.0"}},{"$f":"Vegetation!$K9","v":{"v":79,"d":"79.0"}}]
[{"$f":"Scenarios!A9","v":"Scenario 07: "},{"$f":"Scenarios!B9","v":"-"},{"$f":"Scenarios!C9","v":"-"},{"$f":"'Climate Assumptions'!$L4","v":"-"},{"$f":"'Climate Assumptions'!$L5","v":"-"},{"$f":"'Climate Assumptions'!$L9","v":"-"},{"$f":"Interventions!$L3","v":"-"},{"$f":"Interventions!$L4","v":"-"},{"$f":"Interventions!$L5","v":"-"},{"$f":"Interventions!$L7","v":"-"},{"$f":"Interventions!$L8","v":"-"},{"$f":"Interventions!$L9","v":"-"},{"$f":"Interventions!$L11","v":"-"},{"$f":"Interventions!$L12","v":"-"},{"$f":"Interventions!$L13","v":"-"},{"$f":"Interventions!$L15","v":"-"},{"$f":"Interventions!$L17","v":"-"},{"$f":"Interventions!$L18","v":"-"},{"$f":"Interventions!$L19","v":"-"},{"$f":"Interventions!$L20","v":"-"},{"$f":"Interventions!$L22","v":"-"},{"$f":"Interventions!$L23","v":"-"},{"$f":"Interventions!$L24","v":"-"},{"$f":"Interventions!$L25","v":"-"},{"$f":"Interventions!$L26","v":"-"},{"$f":"Interventions!$L28","v":"-"},{"$f":"Interventions!$L29","v":"-"},{"$f":"Interventions!$L30","v":"-"},{"$f":"Interventions!$L32","v":"-"},{"$f":"Interventions!$L33","v":"-"},{"$f":"Interventions!$L34","v":"-"},{"$f":"Interventions!$L36","v":"-"},{"$f":"Interventions!$L37","v":"-"},{"$f":"Interventions!$L38","v":"-"},{"$f":"Interventions!$L39","v":"-"},{"$f":"Interventions!$L40","v":"-"},{"$f":"'Soil Chemical'!$L3","v":"-"},{"$f":"'Soil Chemical'!$L4","v":"-"},{"$f":"'Soil Chemical'!$L$5","v":"-"},{"$f":"'Soil Chemical'!$L7","v":"-"},{"$f":"'Soil Chemical'!$L8","v":"-"},{"$f":"'Soil Chemical'!$L9","v":"-"},{"$f":"'Soil Chemical'!$L11","v":"-"},{"$f":"'Soil Chemical'!$L12","v":"-"},{"$f":"'Soil Chemical'!$L13","v":"-"},{"$f":"'Soil Chemical'!$L15","v":"-"},{"$f":"'Soil Chemical'!$L16","v":"-"},{"$f":"'Soil Chemical'!$L17","v":"-"},{"$f":"'Soil Chemical'!$L19","v":"-"},{"$f":"'Soil Chemical'!$L20","v":"-"},{"$f":"'Soil Chemical'!$L21","v":"-"},{"$f":"'Soil physical'!$L3","v":"-"},{"$f":"'Soil physical'!$L4","v":"-"},{"$f":"'Soil physical'!$L6","v":"-"},{"$f":"'Soil physical'!$L7","v":"-"},{"$f":"'Soil physical'!$L9","v":"-"},{"$f":"'Soil physical'!$L10","v":"-"},{"$f":"'Soil physical'!$L12","v":"-"},{"$f":"'Soil physical'!$L13","v":"-"},{"$f":"'Soil physical'!$L15","v":"-"},{"$f":"'Soil physical'!$L16","v":"-"},{"$f":"Vegetation!$L3","v":"-"},{"$f":"Vegetation!$L4","v":"-"},{"$f":"Vegetation!$L6","v":{"v":0,"d":"0.0"}},{"$f":"Vegetation!$L7","v":"-"},{"$f":"Vegetation!$L8","v":"-"},{"$f":"Vegetation!$L9","v":"-"}]
[{"$f":"Scenarios!A10","v":"Scenario 08: "},{"$f":"Scenarios!B10","v":"-"},{"$f":"Scenarios!C10","v":"-"},{"$f":"'Climate Assumptions'!$M4","v":"-"},{"$f":"'Climate Assumptions'!$M5","v":"-"},{"$f":"'Climate Assumptions'!$M9","v":"-"},{"$f":"Interventions!$M3","v":"-"},{"$f":"Interventions!$M4","v":"-"},{"$f":"Interventions!$M5","v":"-"},{"$f":"Interventions!$M7","v":"-"},{"$f":"Interventions!$M8","v":"-"},{"$f":"Interventions!$M9","v":"-"},{"$f":"Interventions!$M11","v":"-"},{"$f":"Interventions!$M12","v":"-"},{"$f":"Interventions!$M13","v":"-"},{"$f":"Interventions!$M15","v":"-"},{"$f":"Interventions!$M17","v":"-"},{"$f":"Interventions!$M18","v":"-"},{"$f":"Interventions!$M19","v":"-"},{"$f":"Interventions!$M20","v":"-"},{"$f":"Interventions!$M22","v":"-"},{"$f":"Interventions!$M23","v":"-"},{"$f":"Interventions!$M24","v":"-"},{"$f":"Interventions!$M25","v":"-"},{"$f":"Interventions!$M26","v":"-"},{"$f":"Interventions!$M28","v":"-"},{"$f":"Interventions!$M29","v":"-"},{"$f":"Interventions!$M30","v":"-"},{"$f":"Interventions!$M32","v":"-"},{"$f":"Interventions!$M33","v":"-"},{"$f":"Interventions!$M34","v":"-"},{"$f":"Interventions!$M36","v":"-"},{"$f":"Interventions!$M37","v":"-"},{"$f":"Interventions!$M38","v":"-"},{"$f":"Interventions!$M39","v":"-"},{"$f":"Interventions!$M40","v":"-"},{"$f":"'Soil Chemical'!$M3","v":"-"},{"$f":"'Soil Chemical'!$M4","v":"-"},{"$f":"'Soil Chemical'!$M$5","v":"-"},{"$f":"'Soil Chemical'!$M7","v":"-"},{"$f":"'Soil Chemical'!$M8","v":"-"},{"$f":"'Soil Chemical'!$M9","v":"-"},{"$f":"'Soil Chemical'!$M11","v":"-"},{"$f":"'Soil Chemical'!$M12","v":"-"},{"$f":"'Soil Chemical'!$M13","v":"-"},{"$f":"'Soil Chemical'!$M15","v":"-"},{"$f":"'Soil Chemical'!$M16","v":"-"},{"$f":"'Soil Chemical'!$M17","v":"-"},{"$f":"'Soil Chemical'!$M19","v":"-"},{"$f":"'Soil Chemical'!$M20","v":"-"},{"$f":"'Soil Chemical'!$M21","v":"-"},{"$f":"'Soil physical'!$M3","v":"-"},{"$f":"'Soil physical'!$M4","v":"-"},{"$f":"'Soil physical'!$M6","v":"-"},{"$f":"'Soil physical'!$M7","v":"-"},{"$f":"'Soil physical'!$M9","v":"-"},{"$f":"'Soil physical'!$M10","v":"-"},{"$f":"'Soil physical'!$M12","v":"-"},{"$f":"'Soil physical'!$M13","v":"-"},{"$f":"'Soil physical'!$M15","v":"-"},{"$f":"'Soil physical'!$M16","v":"-"},{"$f":"Vegetation!$M3","v":"-"},{"$f":"Vegetation!$M4","v":"-"},{"$f":"Vegetation!$M6","v":"-"},{"$f":"Vegetation!$M7","v":"-"},{"$f":"Vegetation!$M8","v":"-"},{"$f":"Vegetation!$M9","v":"-"}]
[{"$f":"Scenarios!A11","v":"Scenario 09: "},{"$f":"Scenarios!B11","v":"-"},{"$f":"Scenarios!C11","v":"-"},{"$f":"'Climate Assumptions'!$N4","v":"-"},{"$f":"'Climate Assumptions'!$N5","v":"-"},{"$f":"'Climate Assumptions'!$N9","v":"-"},{"$f":"Interventions!$N3","v":"-"},{"$f":"Interventions!$N4","v":"-"},{"$f":"Interventions!$N5","v":"-"},{"$f":"Interventions!$N7","v":"-"},{"$f":"Interventions!$N8","v":"-"},{"$f":"Interventions!$N9","v":"-"},{"$f":"Interventions!$N11","v":"-"},{"$f":"Interventions!$N12","v":"-"},{"$f":"Interventions!$N13","v":"-"},{"$f":"Interventions!$N15","v":"-"},{"$f":"Interventions!$N17","v":"-"},{"$f":"Interventions!$N18","v":"-"},{"$f":"Interventions!$N19","v":"-"},{"$f":"Interventions!$N20","v":"-"},{"$f":"Interventions!$N22","v":"-"},{"$f":"Interventions!$N23","v":"-"},{"$f":"Interventions!$N24","v":"-"},{"$f":"Interventions!$N25","v":"-"},{"$f":"Interventions!$N26","v":"-"},{"$f":"Interventions!$N28","v":"-"},{"$f":"Interventions!$N29","v":"-"},{"$f":"Interventions!$N30","v":"-"},{"$f":"Interventions!$N32","v":"-"},{"$f":"Interventions!$N33","v":"-"},{"$f":"Interventions!$N34","v":"-"},{"$f":"Interventions!$N36","v":"-"},{"$f":"Interventions!$N37","v":"-"},{"$f":"Interventions!$N38","v":"-"},{"$f":"Interventions!$N39","v":"-"},{"$f":"Interventions!$N40","v":"-"},{"$f":"'Soil Chemical'!$N3","v":"-"},{"$f":"'Soil Chemical'!$N4","v":"-"},{"$f":"'Soil Chemical'!$N$5","v":"-"},{"$f":"'Soil Chemical'!$N7","v":"-"},{"$f":"'Soil Chemical'!$N8","v":"-"},{"$f":"'Soil Chemical'!$N9","v":"-"},{"$f":"'Soil Chemical'!$N11","v":"-"},{"$f":"'Soil Chemical'!$N12","v":"-"},{"$f":"'Soil Chemical'!$N13","v":"-"},{"$f":"'Soil Chemical'!$N15","v":"-"},{"$f":"'Soil Chemical'!$N16","v":"-"},{"$f":"'Soil Chemical'!$N17","v":"-"},{"$f":"'Soil Chemical'!$N19","v":"-"},{"$f":"'Soil Chemical'!$N20","v":"-"},{"$f":"'Soil Chemical'!$N21","v":"-"},{"$f":"'Soil physical'!$N3","v":"-"},{"$f":"'Soil physical'!$N4","v":"-"},{"$f":"'Soil physical'!$N6","v":"-"},{"$f":"'Soil physical'!$N7","v":"-"},{"$f":"'Soil physical'!$N9","v":"-"},{"$f":"'Soil physical'!$N10","v":"-"},{"$f":"'Soil physical'!$N12","v":"-"},{"$f":"'Soil physical'!$N13","v":"-"},{"$f":"'Soil physical'!$N15","v":"-"},{"$f":"'Soil physical'!$N16","v":"-"},{"$f":"Vegetation!$N3","v":"-"},{"$f":"Vegetation!$N4","v":"-"},{"$f":"Vegetation!$N6","v":"-"},{"$f":"Vegetation!$N7","v":"-"},{"$f":"Vegetation!$N8","v":"-"},{"$f":"Vegetation!$N9","v":"-"}]
[{"$f":"Scenarios!A12","v":"Scenario 10: "},{"$f":"Scenarios!B12","v":"-"},{"$f":"Scenarios!C12","v":"-"},{"$f":"'Climate Assumptions'!$O4","v":"-"},{"$f":"'Climate Assumptions'!$O5","v":"-"},{"$f":"'Climate Assumptions'!$O9","v":"-"},{"$f":"Interventions!$O3","v":"-"},{"$f":"Interventions!$O4","v":"-"},{"$f":"Interventions!$O5","v":"-"},{"$f":"Interventions!$O7","v":"-"},{"$f":"Interventions!$O8","v":"-"},{"$f":"Interventions!$O9","v":"-"},{"$f":"Interventions!$O11","v":"-"},{"$f":"Interventions!$O12","v":"-"},{"$f":"Interventions!$O13","v":"-"},{"$f":"Interventions!$O15","v":"-"},{"$f":"Interventions!$O17","v":"-"},{"$f":"Interventions!$O18","v":"-"},{"$f":"Interventions!$O19","v":"-"},{"$f":"Interventions!$O20","v":"-"},{"$f":"Interventions!$O22","v":"-"},{"$f":"Interventions!$O23","v":"-"},{"$f":"Interventions!$O24","v":"-"},{"$f":"Interventions!$O25","v":"-"},{"$f":"Interventions!$O26","v":"-"},{"$f":"Interventions!$O28","v":"-"},{"$f":"Interventions!$O29","v":"-"},{"$f":"Interventions!$O30","v":"-"},{"$f":"Interventions!$O32","v":"-"},{"$f":"Interventions!$O33","v":"-"},{"$f":"Interventions!$O34","v":"-"},{"$f":"Interventions!$O36","v":"-"},{"$f":"Interventions!$O37","v":"-"},{"$f":"Interventions!$O38","v":"-"},{"$f":"Interventions!$O39","v":"-"},{"$f":"Interventions!$O40","v":"-"},{"$f":"'Soil Chemical'!$O3","v":"-"},{"$f":"'Soil Chemical'!$O4","v":"-"},{"$f":"'Soil Chemical'!$O$5","v":"-"},{"$f":"'Soil Chemical'!$O7","v":"-"},{"$f":"'Soil Chemical'!$O8","v":"-"},{"$f":"'Soil Chemical'!$O9","v":"-"},{"$f":"'Soil Chemical'!$O11","v":"-"},{"$f":"'Soil Chemical'!$O12","v":"-"},{"$f":"'Soil Chemical'!$O13","v":"-"},{"$f":"'Soil Chemical'!$O15","v":"-"},{"$f":"'Soil Chemical'!$O16","v":"-"},{"$f":"'Soil Chemical'!$O17","v":"-"},{"$f":"'Soil Chemical'!$O19","v":"-"},{"$f":"'Soil Chemical'!$O20","v":"-"},{"$f":"'Soil Chemical'!$O21","v":"-"},{"$f":"'Soil physical'!$O3","v":"-"},{"$f":"'Soil physical'!$O4","v":"-"},{"$f":"'Soil physical'!$O6","v":"-"},{"$f":"'Soil physical'!$O7","v":"-"},{"$f":"'Soil physical'!$O9","v":"-"},{"$f":"'Soil physical'!$O10","v":"-"},{"$f":"'Soil physical'!$O12","v":"-"},{"$f":"'Soil physical'!$O13","v":"-"},{"$f":"'Soil physical'!$O15","v":"-"},{"$f":"'Soil physical'!$O16","v":"-"},{"$f":"Vegetation!$O3","v":"-"},{"$f":"Vegetation!$O4","v":"-"},{"$f":"Vegetation!$O6","v":"-"},{"$f":"Vegetation!$O7","v":"-"},{"$f":"Vegetation!$O8","v":"-"},{"$f":"Vegetation!$O9","v":"-"}]
[{"$f":"Scenarios!A13","v":"Scenario 11: "},{"$f":"Scenarios!B13","v":"-"},{"$f":"Scenarios!C13","v":"-"},{"$f":"'Climate Assumptions'!$P4","v":"-"},{"$f":"'Climate Assumptions'!$P5","v":"-"},{"$f":"'Climate Assumptions'!$P9","v":"-"},{"$f":"Interventions!$P3","v":"-"},{"$f":"Interventions!$P4","v":"-"},{"$f":"Interventions!$P5","v":"-"},{"$f":"Interventions!$P7","v":"-"},{"$f":"Interventions!$P8","v":"-"},{"$f":"Interventions!$P9","v":"-"},{"$f":"Interventions!$P11","v":"-"},{"$f":"Interventions!$P12","v":"-"},{"$f":"Interventions!$P13","v":"-"},{"$f":"Interventions!$P15","v":"-"},{"$f":"Interventions!$P17","v":"-"},{"$f":"Interventions!$P18","v":"-"},{"$f":"Interventions!$P19","v":"-"},{"$f":"Interventions!$P20","v":"-"},{"$f":"Interventions!$P22","v":"-"},{"$f":"Interventions!$P23","v":"-"},{"$f":"Interventions!$P24","v":"-"},{"$f":"Interventions!$P25","v":"-"},{"$f":"Interventions!$P26","v":"-"},{"$f":"Interventions!$P28","v":"-"},{"$f":"Interventions!$P29","v":"-"},{"$f":"Interventions!$P30","v":"-"},{"$f":"Interventions!$P32","v":"-"},{"$f":"Interventions!$P33","v":"-"},{"$f":"Interventions!$P34","v":"-"},{"$f":"Interventions!$P36","v":"-"},{"$f":"Interventions!$P37","v":"-"},{"$f":"Interventions!$P38","v":"-"},{"$f":"Interventions!$P39","v":"-"},{"$f":"Interventions!$P40","v":"-"},{"$f":"'Soil Chemical'!$P3","v":"-"},{"$f":"'Soil Chemical'!$P4","v":"-"},{"$f":"'Soil Chemical'!$P$5","v":"-"},{"$f":"'Soil Chemical'!$P7","v":"-"},{"$f":"'Soil Chemical'!$P8","v":"-"},{"$f":"'Soil Chemical'!$P9","v":"-"},{"$f":"'Soil Chemical'!$P11","v":"-"},{"$f":"'Soil Chemical'!$P12","v":"-"},{"$f":"'Soil Chemical'!$P13","v":"-"},{"$f":"'Soil Chemical'!$P15","v":"-"},{"$f":"'Soil Chemical'!$P16","v":"-"},{"$f":"'Soil Chemical'!$P17","v":"-"},{"$f":"'Soil Chemical'!$P19","v":"-"},{"$f":"'Soil Chemical'!$P20","v":"-"},{"$f":"'Soil Chemical'!$P21","v":"-"},{"$f":"'Soil physical'!$P3","v":"-"},{"$f":"'Soil physical'!$P4","v":"-"},{"$f":"'Soil physical'!$P6","v":"-"},{"$f":"'Soil physical'!$P7","v":"-"},{"$f":"'Soil physical'!$P9","v":"-"},{"$f":"'Soil physical'!$P10","v":"-"},{"$f":"'Soil physical'!$P12","v":"-"},{"$f":"'Soil physical'!$P13","v":"-"},{"$f":"'Soil physical'!$P15","v":"-"},{"$f":"'Soil physical'!$P16","v":"-"},{"$f":"Vegetation!$P3","v":"-"},{"$f":"Vegetation!$P4","v":"-"},{"$f":"Vegetation!$P6","v":"-"},{"$f":"Vegetation!$P7","v":"-"},{"$f":"Vegetation!$P8","v":"-"},{"$f":"Vegetation!$P9","v":"-"}]
[{"$f":"Scenarios!A14","v":"Scenario 12: "},{"$f":"Scenarios!B14","v":"-"},{"$f":"Scenarios!C14","v":"-"},{"$f":"'Climate Assumptions'!$Q4","v":"-"},{"$f":"'Climate Assumptions'!$Q5","v":"-"},{"$f":"'Climate Assumptions'!$Q9","v":"-"},{"$f":"Interventions!$Q3","v":"-"},{"$f":"Interventions!$Q4","v":"-"},{"$f":"Interventions!$Q5","v":"-"},{"$f":"Interventions!$Q7","v":"-"},{"$f":"Interventions!$Q8","v":"-"},{"$f":"Interventions!$Q9","v":"-"},{"$f":"Interventions!$Q11","v":"-"},{"$f":"Interventions!$Q12","v":"-"},{"$f":"Interventions!$Q13","v":"-"},{"$f":"Interventions!$Q15","v":"-"},{"$f":"Interventions!$Q17","v":"-"},{"$f":"Interventions!$Q18","v":"-"},{"$f":"Interventions!$Q19","v":"-"},{"$f":"Interventions!$Q20","v":"-"},{"$f":"Interventions!$Q22","v":"-"},{"$f":"Interventions!$Q23","v":"-"},{"$f":"Interventions!$Q24","v":"-"},{"$f":"Interventions!$Q25","v":"-"},{"$f":"Interventions!$Q26","v":"-"},{"$f":"Interventions!$Q28","v":"-"},{"$f":"Interventions!$Q29","v":"-"},{"$f":"Interventions!$Q30","v":"-"},{"$f":"Interventions!$Q32","v":"-"},{"$f":"Interventions!$Q33","v":"-"},{"$f":"Interventions!$Q34","v":"-"},{"$f":"Interventions!$Q36","v":"-"},{"$f":"Interventions!$Q37","v":"-"},{"$f":"Interventions!$Q38","v":"-"},{"$f":"Interventions!$Q39","v":"-"},{"$f":"Interventions!$Q40","v":"-"},{"$f":"'Soil Chemical'!$Q3","v":"-"},{"$f":"'Soil Chemical'!$Q4","v":"-"},{"$f":"'Soil Chemical'!$Q$5","v":"-"},{"$f":"'Soil Chemical'!$Q7","v":"-"},{"$f":"'Soil Chemical'!$Q8","v":"-"},{"$f":"'Soil Chemical'!$Q9","v":"-"},{"$f":"'Soil Chemical'!$Q11","v":"-"},{"$f":"'Soil Chemical'!$Q12","v":"-"},{"$f":"'Soil Chemical'!$Q13","v":"-"},{"$f":"'Soil Chemical'!$Q15","v":"-"},{"$f":"'Soil Chemical'!$Q16","v":"-"},{"$f":"'Soil Chemical'!$Q17","v":"-"},{"$f":"'Soil Chemical'!$Q19","v":"-"},{"$f":"'Soil Chemical'!$Q20","v":"-"},{"$f":"'Soil Chemical'!$Q21","v":"-"},{"$f":"'Soil physical'!$Q3","v":"-"},{"$f":"'Soil physical'!$Q4","v":"-"},{"$f":"'Soil physical'!$Q6","v":"-"},{"$f":"'Soil physical'!$Q7","v":"-"},{"$f":"'Soil physical'!$Q9","v":"-"},{"$f":"'Soil physical'!$Q10","v":"-"},{"$f":"'Soil physical'!$Q12","v":"-"},{"$f":"'Soil physical'!$Q13","v":"-"},{"$f":"'Soil physical'!$Q15","v":"-"},{"$f":"'Soil physical'!$Q16","v":"-"},{"$f":"Vegetation!$Q3","v":"-"},{"$f":"Vegetation!$Q4","v":"-"},{"$f":"Vegetation!$Q6","v":"-"},{"$f":"Vegetation!$Q7","v":"-"},{"$f":"Vegetation!$Q8","v":"-"},{"$f":"Vegetation!$Q9","v":"-"}]
[{"$f":"Scenarios!A15","v":"Scenario 13: "},{"$f":"Scenarios!B15","v":"-"},{"$f":"Scenarios!C15","v":"-"},{"$f":"'Climate Assumptions'!$R4","v":"-"},{"$f":"'Climate Assumptions'!$R5","v":"-"},{"$f":"'Climate Assumptions'!$R9","v":"-"},{"$f":"Interventions!$R3","v":"-"},{"$f":"Interventions!$R4","v":"-"},{"$f":"Interventions!$R5","v":"-"},{"$f":"Interventions!$R7","v":"-"},{"$f":"Interventions!$R8","v":"-"},{"$f":"Interventions!$R9","v":"-"},{"$f":"Interventions!$R11","v":"-"},{"$f":"Interventions!$R12","v":"-"},{"$f":"Interventions!$R13","v":"-"},{"$f":"Interventions!$R15","v":"-"},{"$f":"Interventions!$R17","v":"-"},{"$f":"Interventions!$R18","v":"-"},{"$f":"Interventions!$R19","v":"-"},{"$f":"Interventions!$R20","v":"-"},{"$f":"Interventions!$R22","v":"-"},{"$f":"Interventions!$R23","v":"-"},{"$f":"Interventions!$R24","v":"-"},{"$f":"Interventions!$R25","v":"-"},{"$f":"Interventions!$R26","v":"-"},{"$f":"Interventions!$R28","v":"-"},{"$f":"Interventions!$R29","v":"-"},{"$f":"Interventions!$R30","v":"-"},{"$f":"Interventions!$R32","v":"-"},{"$f":"Interventions!$R33","v":"-"},{"$f":"Interventions!$R34","v":"-"},{"$f":"Interventions!$R36","v":"-"},{"$f":"Interventions!$R37","v":"-"},{"$f":"Interventions!$R38","v":"-"},{"$f":"Interventions!$R39","v":"-"},{"$f":"Interventions!$R40","v":"-"},{"$f":"'Soil Chemical'!$R3","v":"-"},{"$f":"'Soil Chemical'!$R4","v":"-"},{"$f":"'Soil Chemical'!$R$5","v":"-"},{"$f":"'Soil Chemical'!$R7","v":"-"},{"$f":"'Soil Chemical'!$R8","v":"-"},{"$f":"'Soil Chemical'!$R9","v":"-"},{"$f":"'Soil Chemical'!$R11","v":"-"},{"$f":"'Soil Chemical'!$R12","v":"-"},{"$f":"'Soil Chemical'!$R13","v":"-"},{"$f":"'Soil Chemical'!$R15","v":"-"},{"$f":"'Soil Chemical'!$R16","v":"-"},{"$f":"'Soil Chemical'!$R17","v":"-"},{"$f":"'Soil Chemical'!$R19","v":"-"},{"$f":"'Soil Chemical'!$R20","v":"-"},{"$f":"'Soil Chemical'!$R21","v":"-"},{"$f":"'Soil physical'!$R3","v":"-"},{"$f":"'Soil physical'!$R4","v":"-"},{"$f":"'Soil physical'!$R6","v":"-"},{"$f":"'Soil physical'!$R7","v":"-"},{"$f":"'Soil physical'!$R9","v":"-"},{"$f":"'Soil physical'!$R10","v":"-"},{"$f":"'Soil physical'!$R12","v":"-"},{"$f":"'Soil physical'!$R13","v":"-"},{"$f":"'Soil physical'!$R15","v":"-"},{"$f":"'Soil physical'!$R16","v":"-"},{"$f":"Vegetation!$R3","v":"-"},{"$f":"Vegetation!$R4","v":"-"},{"$f":"Vegetation!$R6","v":"-"},{"$f":"Vegetation!$R7","v":"-"},{"$f":"Vegetation!$R8","v":"-"},{"$f":"Vegetation!$R9","v":"-"}]
[{"$f":"Scenarios!A16","v":"Scenario 14: "},{"$f":"Scenarios!B16","v":"-"},{"$f":"Scenarios!C16","v":"-"},{"$f":"'Climate Assumptions'!$S4","v":"-"},{"$f":"'Climate Assumptions'!$S5","v":"-"},{"$f":"'Climate Assumptions'!$S9","v":"-"},{"$f":"Interventions!$S3","v":"-"},{"$f":"Interventions!$S4","v":"-"},{"$f":"Interventions!$S5","v":"-"},{"$f":"Interventions!$S7","v":"-"},{"$f":"Interventions!$S8","v":"-"},{"$f":"Interventions!$S9","v":"-"},{"$f":"Interventions!$S11","v":"-"},{"$f":"Interventions!$S12","v":"-"},{"$f":"Interventions!$S13","v":"-"},{"$f":"Interventions!$S15","v":"-"},{"$f":"Interventions!$S17","v":"-"},{"$f":"Interventions!$S18","v":"-"},{"$f":"Interventions!$S19","v":"-"},{"$f":"Interventions!$S20","v":"-"},{"$f":"Interventions!$S22","v":"-"},{"$f":"Interventions!$S23","v":"-"},{"$f":"Interventions!$S24","v":"-"},{"$f":"Interventions!$S25","v":"-"},{"$f":"Interventions!$S26","v":"-"},{"$f":"Interventions!$S28","v":"-"},{"$f":"Interventions!$S29","v":"-"},{"$f":"Interventions!$S30","v":"-"},{"$f":"Interventions!$S32","v":"-"},{"$f":"Interventions!$S33","v":"-"},{"$f":"Interventions!$S34","v":"-"},{"$f":"Interventions!$S36","v":"-"},{"$f":"Interventions!$S37","v":"-"},{"$f":"Interventions!$S38","v":"-"},{"$f":"Interventions!$S39","v":"-"},{"$f":"Interventions!$S40","v":"-"},{"$f":"'Soil Chemical'!$S3","v":"-"},{"$f":"'Soil Chemical'!$S4","v":"-"},{"$f":"'Soil Chemical'!$S$5","v":"-"},{"$f":"'Soil Chemical'!$S7","v":"-"},{"$f":"'Soil Chemical'!$S8","v":"-"},{"$f":"'Soil Chemical'!$S9","v":"-"},{"$f":"'Soil Chemical'!$S11","v":"-"},{"$f":"'Soil Chemical'!$S12","v":"-"},{"$f":"'Soil Chemical'!$S13","v":"-"},{"$f":"'Soil Chemical'!$S15","v":"-"},{"$f":"'Soil Chemical'!$S16","v":"-"},{"$f":"'Soil Chemical'!$S17","v":"-"},{"$f":"'Soil Chemical'!$S19","v":"-"},{"$f":"'Soil Chemical'!$S20","v":"-"},{"$f":"'Soil Chemical'!$S21","v":"-"},{"$f":"'Soil physical'!$S3","v":"-"},{"$f":"'Soil physical'!$S4","v":"-"},{"$f":"'Soil physical'!$S6","v":"-"},{"$f":"'Soil physical'!$S7","v":"-"},{"$f":"'Soil physical'!$S9","v":"-"},{"$f":"'Soil physical'!$S10","v":"-"},{"$f":"'Soil physical'!$S12","v":"-"},{"$f":"'Soil physical'!$S13","v":"-"},{"$f":"'Soil physical'!$S15","v":"-"},{"$f":"'Soil physical'!$S16","v":"-"},{"$f":"Vegetation!$S3","v":"-"},{"$f":"Vegetation!$S4","v":"-"},{"$f":"Vegetation!$S6","v":"-"},{"$f":"Vegetation!$S7","v":"-"},{"$f":"Vegetation!$S8","v":"-"},{"$f":"Vegetation!$S9","v":"-"}]
[{"$f":"Scenarios!A17","v":"Scenario 15: "},{"$f":"Scenarios!B17","v":"-"},{"$f":"Scenarios!C17","v":"-"},{"$f":"'Climate Assumptions'!$T4","v":"-"},{"$f":"'Climate Assumptions'!$T5","v":"-"},{"$f":"'Climate Assumptions'!$T9","v":"-"},{"$f":"Interventions!$T3","v":"-"},{"$f":"Interventions!$T4","v":"-"},{"$f":"Interventions!$T5","v":"-"},{"$f":"Interventions!$T7","v":"-"},{"$f":"Interventions!$T8","v":"-"},{"$f":"Interventions!$T9","v":"-"},{"$f":"Interventions!$T11","v":"-"},{"$f":"Interventions!$T12","v":"-"},{"$f":"Interventions!$T13","v":"-"},{"$f":"Interventions!$T15","v":"-"},{"$f":"Interventions!$T17","v":"-"},{"$f":"Interventions!$T18","v":"-"},{"$f":"Interventions!$T19","v":"-"},{"$f":"Interventions!$T20","v":"-"},{"$f":"Interventions!$T22","v":"-"},{"$f":"Interventions!$T23","v":"-"},{"$f":"Interventions!$T24","v":"-"},{"$f":"Interventions!$T25","v":"-"},{"$f":"Interventions!$T26","v":"-"},{"$f":"Interventions!$T28","v":"-"},{"$f":"Interventions!$T29","v":"-"},{"$f":"Interventions!$T30","v":"-"},{"$f":"Interventions!$T32","v":"-"},{"$f":"Interventions!$T33","v":"-"},{"$f":"Interventions!$T34","v":"-"},{"$f":"Interventions!$T36","v":"-"},{"$f":"Interventions!$T37","v":"-"},{"$f":"Interventions!$T38","v":"-"},{"$f":"Interventions!$T39","v":"-"},{"$f":"Interventions!$T40","v":"-"},{"$f":"'Soil Chemical'!$T3","v":"-"},{"$f":"'Soil Chemical'!$T4","v":"-"},{"$f":"'Soil Chemical'!$T$5","v":"-"},{"$f":"'Soil Chemical'!$T7","v":"-"},{"$f":"'Soil Chemical'!$T8","v":"-"},{"$f":"'Soil Chemical'!$T9","v":"-"},{"$f":"'Soil Chemical'!$T11","v":"-"},{"$f":"'Soil Chemical'!$T12","v":"-"},{"$f":"'Soil Chemical'!$T13","v":"-"},{"$f":"'Soil Chemical'!$T15","v":"-"},{"$f":"'Soil Chemical'!$T16","v":"-"},{"$f":"'Soil Chemical'!$T17","v":"-"},{"$f":"'Soil Chemical'!$T19","v":"-"},{"$f":"'Soil Chemical'!$T20","v":"-"},{"$f":"'Soil Chemical'!$T21","v":"-"},{"$f":"'Soil physical'!$T3","v":"-"},{"$f":"'Soil physical'!$T4","v":"-"},{"$f":"'Soil physical'!$T6","v":"-"},{"$f":"'Soil physical'!$T7","v":"-"},{"$f":"'Soil physical'!$T9","v":"-"},{"$f":"'Soil physical'!$T10","v":"-"},{"$f":"'Soil physical'!$T12","v":"-"},{"$f":"'Soil physical'!$T13","v":"-"},{"$f":"'Soil physical'!$T15","v":"-"},{"$f":"'Soil physical'!$T16","v":"-"},{"$f":"Vegetation!$T3","v":"-"},{"$f":"Vegetation!$T4","v":"-"},{"$f":"Vegetation!$T6","v":"-"},{"$f":"Vegetation!$T7","v":"-"},{"$f":"Vegetation!$T8","v":"-"},{"$f":"Vegetation!$T9","v":"-"}]
[{"$f":"Scenarios!A18","v":"Scenario 16: "},{"$f":"Scenarios!B18","v":"-"},{"$f":"Scenarios!C18","v":"-"},{"$f":"'Climate Assumptions'!$U4","v":"-"},{"$f":"'Climate Assumptions'!$U5","v":"-"},{"$f":"'Climate Assumptions'!$U9","v":"-"},{"$f":"Interventions!$U3","v":"-"},{"$f":"Interventions!$U4","v":"-"},{"$f":"Interventions!$U5","v":"-"},{"$f":"Interventions!$U7","v":"-"},{"$f":"Interventions!$U8","v":"-"},{"$f":"Interventions!$U9","v":"-"},{"$f":"Interventions!$U11","v":"-"},{"$f":"Interventions!$U12","v":"-"},{"$f":"Interventions!$U13","v":"-"},{"$f":"Interventions!$U15","v":"-"},{"$f":"Interventions!$U17","v":"-"},{"$f":"Interventions!$U18","v":"-"},{"$f":"Interventions!$U19","v":"-"},{"$f":"Interventions!$U20","v":"-"},{"$f":"Interventions!$U22","v":"-"},{"$f":"Interventions!$U23","v":"-"},{"$f":"Interventions!$U24","v":"-"},{"$f":"Interventions!$U25","v":"-"},{"$f":"Interventions!$U26","v":"-"},{"$f":"Interventions!$U28","v":"-"},{"$f":"Interventions!$U29","v":"-"},{"$f":"Interventions!$U30","v":"-"},{"$f":"Interventions!$U32","v":"-"},{"$f":"Interventions!$U33","v":"-"},{"$f":"Interventions!$U34","v":"-"},{"$f":"Interventions!$U36","v":"-"},{"$f":"Interventions!$U37","v":"-"},{"$f":"Interventions!$U38","v":"-"},{"$f":"Interventions!$U39","v":"-"},{"$f":"Interventions!$U40","v":"-"},{"$f":"'Soil Chemical'!$U3","v":"-"},{"$f":"'Soil Chemical'!$U4","v":"-"},{"$f":"'Soil Chemical'!$U$5","v":"-"},{"$f":"'Soil Chemical'!$U7","v":"-"},{"$f":"'Soil Chemical'!$U8","v":"-"},{"$f":"'Soil Chemical'!$U9","v":"-"},{"$f":"'Soil Chemical'!$U11","v":"-"},{"$f":"'Soil Chemical'!$U12","v":"-"},{"$f":"'Soil Chemical'!$U13","v":"-"},{"$f":"'Soil Chemical'!$U15","v":"-"},{"$f":"'Soil Chemical'!$U16","v":"-"},{"$f":"'Soil Chemical'!$U17","v":"-"},{"$f":"'Soil Chemical'!$U19","v":"-"},{"$f":"'Soil Chemical'!$U20","v":"-"},{"$f":"'Soil Chemical'!$U21","v":"-"},{"$f":"'Soil physical'!$U3","v":"-"},{"$f":"'Soil physical'!$U4","v":"-"},{"$f":"'Soil physical'!$U6","v":"-"},{"$f":"'Soil physical'!$U7","v":"-"},{"$f":"'Soil physical'!$U9","v":"-"},{"$f":"'Soil physical'!$U10","v":"-"},{"$f":"'Soil physical'!$U12","v":"-"},{"$f":"'Soil physical'!$U13","v":"-"},{"$f":"'Soil physical'!$U15","v":"-"},{"$f":"'Soil physical'!$U16","v":"-"},{"$f":"Vegetation!$U3","v":"-"},{"$f":"Vegetation!$U4","v":"-"},{"$f":"Vegetation!$U6","v":"-"},{"$f":"Vegetation!$U7","v":"-"},{"$f":"Vegetation!$U8","v":"-"},{"$f":"Vegetation!$U9","v":"-"}]
[{"$f":"Scenarios!A19","v":"Scenario 17: "},{"$f":"Scenarios!B19","v":"-"},{"$f":"Scenarios!C19","v":"-"},{"$f":"'Climate Assumptions'!$V4","v":"-"},{"$f":"'Climate Assumptions'!$V5","v":"-"},{"$f":"'Climate Assumptions'!$V9","v":"-"},{"$f":"Interventions!$V3","v":"-"},{"$f":"Interventions!$V4","v":"-"},{"$f":"Interventions!$V5","v":"-"},{"$f":"Interventions!$V7","v":"-"},{"$f":"Interventions!$V8","v":"-"},{"$f":"Interventions!$V9","v":"-"},{"$f":"Interventions!$V11","v":"-"},{"$f":"Interventions!$V12","v":"-"},{"$f":"Interventions!$V13","v":"-"},{"$f":"Interventions!$V15","v":"-"},{"$f":"Interventions!$V17","v":"-"},{"$f":"Interventions!$V18","v":"-"},{"$f":"Interventions!$V19","v":"-"},{"$f":"Interventions!$V20","v":"-"},{"$f":"Interventions!$V22","v":"-"},{"$f":"Interventions!$V23","v":"-"},{"$f":"Interventions!$V24","v":"-"},{"$f":"Interventions!$V25","v":"-"},{"$f":"Interventions!$V26","v":"-"},{"$f":"Interventions!$V28","v":"-"},{"$f":"Interventions!$V29","v":"-"},{"$f":"Interventions!$V30","v":"-"},{"$f":"Interventions!$V32","v":"-"},{"$f":"Interventions!$V33","v":"-"},{"$f":"Interventions!$V34","v":"-"},{"$f":"Interventions!$V36","v":"-"},{"$f":"Interventions!$V37","v":"-"},{"$f":"Interventions!$V38","v":"-"},{"$f":"Interventions!$V39","v":"-"},{"$f":"Interventions!$V40","v":"-"},{"$f":"'Soil Chemical'!$V3","v":"-"},{"$f":"'Soil Chemical'!$V4","v":"-"},{"$f":"'Soil Chemical'!$V$5","v":"-"},{"$f":"'Soil Chemical'!$V7","v":"-"},{"$f":"'Soil Chemical'!$V8","v":"-"},{"$f":"'Soil Chemical'!$V9","v":"-"},{"$f":"'Soil Chemical'!$V11","v":"-"},{"$f":"'Soil Chemical'!$V12","v":"-"},{"$f":"'Soil Chemical'!$V13","v":"-"},{"$f":"'Soil Chemical'!$V15","v":"-"},{"$f":"'Soil Chemical'!$V16","v":"-"},{"$f":"'Soil Chemical'!$V17","v":"-"},{"$f":"'Soil Chemical'!$V19","v":"-"},{"$f":"'Soil Chemical'!$V20","v":"-"},{"$f":"'Soil Chemical'!$V21","v":"-"},{"$f":"'Soil physical'!$V3","v":"-"},{"$f":"'Soil physical'!$V4","v":"-"},{"$f":"'Soil physical'!$V6","v":"-"},{"$f":"'Soil physical'!$V7","v":"-"},{"$f":"'Soil physical'!$V9","v":"-"},{"$f":"'Soil physical'!$V10","v":"-"},{"$f":"'Soil physical'!$V12","v":"-"},{"$f":"'Soil physical'!$V13","v":"-"},{"$f":"'Soil physical'!$V15","v":"-"},{"$f":"'Soil physical'!$V16","v":"-"},{"$f":"Vegetation!$V3","v":"-"},{"$f":"Vegetation!$V4","v":"-"},{"$f":"Vegetation!$V6","v":"-"},{"$f":"Vegetation!$V7","v":"-"},{"$f":"Vegetation!$V8","v":"-"},{"$f":"Vegetation!$V9","v":"-"}]
[{"$f":"Scenarios!A20","v":"Scenario 18: "},{"$f":"Scenarios!B20","v":"-"},{"$f":"Scenarios!C20","v":"-"},{"$f":"'Climate Assumptions'!$W4","v":"-"},{"$f":"'Climate Assumptions'!$W5","v":"-"},{"$f":"'Climate Assumptions'!$W9","v":"-"},{"$f":"Interventions!$W3","v":"-"},{"$f":"Interventions!$W4","v":"-"},{"$f":"Interventions!$W5","v":"-"},{"$f":"Interventions!$W7","v":"-"},{"$f":"Interventions!$W8","v":"-"},{"$f":"Interventions!$W9","v":"-"},{"$f":"Interventions!$W11","v":"-"},{"$f":"Interventions!$W12","v":"-"},{"$f":"Interventions!$W13","v":"-"},{"$f":"Interventions!$W15","v":"-"},{"$f":"Interventions!$W17","v":"-"},{"$f":"Interventions!$W18","v":"-"},{"$f":"Interventions!$W19","v":"-"},{"$f":"Interventions!$W20","v":"-"},{"$f":"Interventions!$W22","v":"-"},{"$f":"Interventions!$W23","v":"-"},{"$f":"Interventions!$W24","v":"-"},{"$f":"Interventions!$W25","v":"-"},{"$f":"Interventions!$W26","v":"-"},{"$f":"Interventions!$W28","v":"-"},{"$f":"Interventions!$W29","v":"-"},{"$f":"Interventions!$W30","v":"-"},{"$f":"Interventions!$W32","v":"-"},{"$f":"Interventions!$W33","v":"-"},{"$f":"Interventions!$W34","v":"-"},{"$f":"Interventions!$W36","v":"-"},{"$f":"Interventions!$W37","v":"-"},{"$f":"Interventions!$W38","v":"-"},{"$f":"Interventions!$W39","v":"-"},{"$f":"Interventions!$W40","v":"-"},{"$f":"'Soil Chemical'!$W3","v":"-"},{"$f":"'Soil Chemical'!$W4","v":"-"},{"$f":"'Soil Chemical'!$W$5","v":"-"},{"$f":"'Soil Chemical'!$W7","v":"-"},{"$f":"'Soil Chemical'!$W8","v":"-"},{"$f":"'Soil Chemical'!$W9","v":"-"},{"$f":"'Soil Chemical'!$W11","v":"-"},{"$f":"'Soil Chemical'!$W12","v":"-"},{"$f":"'Soil Chemical'!$W13","v":"-"},{"$f":"'Soil Chemical'!$W15","v":"-"},{"$f":"'Soil Chemical'!$W16","v":"-"},{"$f":"'Soil Chemical'!$W17","v":"-"},{"$f":"'Soil Chemical'!$W19","v":"-"},{"$f":"'Soil Chemical'!$W20","v":"-"},{"$f":"'Soil Chemical'!$W21","v":"-"},{"$f":"'Soil physical'!$W3","v":"-"},{"$f":"'Soil physical'!$W4","v":"-"},{"$f":"'Soil physical'!$W6","v":"-"},{"$f":"'Soil physical'!$W7","v":"-"},{"$f":"'Soil physical'!$W9","v":"-"},{"$f":"'Soil physical'!$W10","v":"-"},{"$f":"'Soil physical'!$W12","v":"-"},{"$f":"'Soil physical'!$W13","v":"-"},{"$f":"'Soil physical'!$W15","v":"-"},{"$f":"'Soil physical'!$W16","v":"-"},{"$f":"Vegetation!$W3","v":"-"},{"$f":"Vegetation!$W4","v":"-"},{"$f":"Vegetation!$W6","v":"-"},{"$f":"Vegetation!$W7","v":"-"},{"$f":"Vegetation!$W8","v":"-"},{"$f":"Vegetation!$W9","v":"-"}]
[{"$f":"Scenarios!A21","v":"Scenario 19: "},{"$f":"Scenarios!B21","v":"-"},{"$f":"Scenarios!C21","v":"-"},{"$f":"'Climate Assumptions'!$X4","v":"-"},{"$f":"'Climate Assumptions'!$X5","v":"-"},{"$f":"'Climate Assumptions'!$X9","v":"-"},{"$f":"Interventions!$X3","v":"-"},{"$f":"Interventions!$X4","v":"-"},{"$f":"Interventions!$X5","v":"-"},{"$f":"Interventions!$X7","v":"-"},{"$f":"Interventions!$X8","v":"-"},{"$f":"Interventions!$X9","v":"-"},{"$f":"Interventions!$X11","v":"-"},{"$f":"Interventions!$X12","v":"-"},{"$f":"Interventions!$X13","v":"-"},{"$f":"Interventions!$X15","v":"-"},{"$f":"Interventions!$X17","v":"-"},{"$f":"Interventions!$X18","v":"-"},{"$f":"Interventions!$X19","v":"-"},{"$f":"Interventions!$X20","v":"-"},{"$f":"Interventions!$X22","v":"-"},{"$f":"Interventions!$X23","v":"-"},{"$f":"Interventions!$X24","v":"-"},{"$f":"Interventions!$X25","v":"-"},{"$f":"Interventions!$X26","v":"-"},{"$f":"Interventions!$X28","v":"-"},{"$f":"Interventions!$X29","v":"-"},{"$f":"Interventions!$X30","v":"-"},{"$f":"Interventions!$X32","v":"-"},{"$f":"Interventions!$X33","v":"-"},{"$f":"Interventions!$X34","v":"-"},{"$f":"Interventions!$X36","v":"-"},{"$f":"Interventions!$X37","v":"-"},{"$f":"Interventions!$X38","v":"-"},{"$f":"Interventions!$X39","v":"-"},{"$f":"Interventions!$X40","v":"-"},{"$f":"'Soil Chemical'!$X3","v":"-"},{"$f":"'Soil Chemical'!$X4","v":"-"},{"$f":"'Soil Chemical'!$X$5","v":"-"},{"$f":"'Soil Chemical'!$X7","v":"-"},{"$f":"'Soil Chemical'!$X8","v":"-"},{"$f":"'Soil Chemical'!$X9","v":"-"},{"$f":"'Soil Chemical'!$X11","v":"-"},{"$f":"'Soil Chemical'!$X12","v":"-"},{"$f":"'Soil Chemical'!$X13","v":"-"},{"$f":"'Soil Chemical'!$X15","v":"-"},{"$f":"'Soil Chemical'!$X16","v":"-"},{"$f":"'Soil Chemical'!$X17","v":"-"},{"$f":"'Soil Chemical'!$X19","v":"-"},{"$f":"'Soil Chemical'!$X20","v":"-"},{"$f":"'Soil Chemical'!$X21","v":"-"},{"$f":"'Soil physical'!$X3","v":"-"},{"$f":"'Soil physical'!$X4","v":"-"},{"$f":"'Soil physical'!$X6","v":"-"},{"$f":"'Soil physical'!$X7","v":"-"},{"$f":"'Soil physical'!$X9","v":"-"},{"$f":"'Soil physical'!$X10","v":"-"},{"$f":"'Soil physical'!$X12","v":"-"},{"$f":"'Soil physical'!$X13","v":"-"},{"$f":"'Soil physical'!$X15","v":"-"},{"$f":"'Soil physical'!$X16","v":"-"},{"$f":"Vegetation!$X3","v":"-"},{"$f":"Vegetation!$X4","v":"-"},{"$f":"Vegetation!$X6","v":"-"},{"$f":"Vegetation!$X7","v":"-"},{"$f":"Vegetation!$X8","v":"-"},{"$f":"Vegetation!$X9","v":"-"}]
[{"$f":"Scenarios!A22","v":"Scenario 20: "},{"$f":"Scenarios!B22","v":"-"},{"$f":"Scenarios!C22","v":"-"},{"$f":"'Climate Assumptions'!$Y4","v":"-"},{"$f":"'Climate Assumptions'!$Y5","v":"-"},{"$f":"'Climate Assumptions'!$Y9","v":"-"},{"$f":"Interventions!$Y3","v":"-"},{"$f":"Interventions!$Y4","v":"-"},{"$f":"Interventions!$Y5","v":"-"},{"$f":"Interventions!$Y7","v":"-"},{"$f":"Interventions!$Y8","v":"-"},{"$f":"Interventions!$Y9","v":"-"},{"$f":"Interventions!$Y11","v":"-"},{"$f":"Interventions!$Y12","v":"-"},{"$f":"Interventions!$Y13","v":"-"},{"$f":"Interventions!$Y15","v":"-"},{"$f":"Interventions!$Y17","v":"-"},{"$f":"Interventions!$Y18","v":"-"},{"$f":"Interventions!$Y19","v":"-"},{"$f":"Interventions!$Y20","v":"-"},{"$f":"Interventions!$Y22","v":"-"},{"$f":"Interventions!$Y23","v":"-"},{"$f":"Interventions!$Y24","v":"-"},{"$f":"Interventions!$Y25","v":"-"},{"$f":"Interventions!$Y26","v":"-"},{"$f":"Interventions!$Y28","v":"-"},{"$f":"Interventions!$Y29","v":"-"},{"$f":"Interventions!$Y30","v":"-"},{"$f":"Interventions!$Y32","v":"-"},{"$f":"Interventions!$Y33","v":"-"},{"$f":"Interventions!$Y34","v":"-"},{"$f":"Interventions!$Y36","v":"-"},{"$f":"Interventions!$Y37","v":"-"},{"$f":"Interventions!$Y38","v":"-"},{"$f":"Interventions!$Y39","v":"-"},{"$f":"Interventions!$Y40","v":"-"},{"$f":"'Soil Chemical'!$Y3","v":"-"},{"$f":"'Soil Chemical'!$Y4","v":"-"},{"$f":"'Soil Chemical'!$Y$5","v":"-"},{"$f":"'Soil Chemical'!$Y7","v":"-"},{"$f":"'Soil Chemical'!$Y8","v":"-"},{"$f":"'Soil Chemical'!$Y9","v":"-"},{"$f":"'Soil Chemical'!$Y11","v":"-"},{"$f":"'Soil Chemical'!$Y12","v":"-"},{"$f":"'Soil Chemical'!$Y13","v":"-"},{"$f":"'Soil Chemical'!$Y15","v":"-"},{"$f":"'Soil Chemical'!$Y16","v":"-"},{"$f":"'Soil Chemical'!$Y17","v":"-"},{"$f":"'Soil Chemical'!$Y19","v":"-"},{"$f":"'Soil Chemical'!$Y20","v":"-"},{"$f":"'Soil Chemical'!$Y21","v":"-"},{"$f":"'Soil physical'!$Y3","v":"-"},{"$f":"'Soil physical'!$Y4","v":"-"},{"$f":"'Soil physical'!$Y6","v":"-"},{"$f":"'Soil physical'!$Y7","v":"-"},{"$f":"'Soil physical'!$Y9","v":"-"},{"$f":"'Soil physical'!$Y10","v":"-"},{"$f":"'Soil physical'!$Y12","v":"-"},{"$f":"'Soil physical'!$Y13","v":"-"},{"$f":"'Soil physical'!$Y15","v":"-"},{"$f":"'Soil physical'!$Y16","v":"-"},{"$f":"Vegetation!$Y3","v":"-"},{"$f":"Vegetation!$Y4","v":"-"},{"$f":"Vegetation!$Y6","v":"-"},{"$f":"Vegetation!$Y7","v":"-"},{"$f":"Vegetation!$Y8","v":"-"},{"$f":"Vegetation!$Y9","v":"-"}]

{"sheet":"Results","index":14,"n_rows":216,"n_cols":7,"rows_kept":216}
["Measurement","Scenario 01","Scenario 02","Scenario 03","Scenario 04","Scenario 05","Scenario 06"]
["Calcium amount relative to requirement layer 3"]
["Low",0.487,0.272,0.046,0.046,0.039,0.039]
["Medium",0.482,0.422,0.879,0.879,0.897,0.897]
["High",0.031,0.306,0.075,0.075,0.064,0.064]
["Ca effectiveness layer 3"]
["Low",0.663,0.367,0.019,0.019,0.006,0.006]
["Medium",0.336,0.234,0.955,0.955,0.985,0.985]
["High",1E-3,0.399,0.026,0.026,0.009,0.009]
["Zeta potential layer 3"]
["mean",-58.99,-38.16,-40.64,-40.64,-54.83,-54.83]
["error",23.34,25,25,25,25.22,25.22]
["High",0.591,0.234,0.261,0.261,0.522,0.522]
["Medium",0.342,0.365,0.399,0.399,0.34,0.34]
["Low",0.067,0.401,0.34,0.34,0.138,0.138]
["Spoil dispersivity layer 3 (NTU)"]
["mean",3505.32,2254.71,2397.82,2397.82,3256.68,3256.68]
["error",3091.23,2812.89,2858.28,2858.28,3081.2,3081.2]
["Low",0.176,0.383,0.348,0.348,0.219,0.219]
["Mid",0.203,0.203,0.213,0.213,0.201,0.201]
["High",0.141,0.136,0.141,0.141,0.139,0.139]
["VeryHigh",0.48,0.278,0.298,0.298,0.44,0.44]
["Ca_availability_1"]
["Low",0.918,0.867,0.351,0.351,0.541,0.541]
["Medium",0.065,0.102,0.41,0.41,0.358,0.358]
["High",0.017,0.031,0.239,0.239,0.101,0.101]
["Calcium amount relative to requirement layer 1"]
["Low",1,1,0.155,0.155,0.273,0.273]
["Medium","-","-",0.29,0.29,0.364,0.364]
["High","-","-",0.555,0.555,0.363,0.363]
["Ca effectiveness layer 1"]
["Low",0.941,0.91,0.003,0.003,0.01,0.01]
["Medium",0.059,0.09,2E-3,2E-3,0.986,0.986]
["High","-","-",0.995,0.995,0.003,0.003]
["Zeta potential layer 1"]
["mean",-53.25,-52.71,-31,-31,-48,-48]
["error",23.55,26.95,20.63,20.63,21.35,21.35]
["High",0.45,0.512,0.1,0.1,0.3,0.3]
["Medium",0.45,0.281,0.4,0.4,0.6,0.6]
["Low",0.1,0.208,0.5,0.5,0.1,0.1]
["Spoil dispersivity layer 1 (NTU)"]
["mean",3145.05,3138.83,1820.37,1820.37,2807.61,2807.61]
["error",3025.8,3092.51,2558.16,2558.16,2902.84,2902.84]
["Low",0.203,0.258,0.446,0.446,0.214,0.214]
["Mid",0.232,0.184,0.21,0.21,0.273,0.273]
["High",0.15,0.133,0.138,0.138,0.164,0.164]
["VeryHigh",0.414,0.426,0.206,0.206,0.349,0.349]
["Nutrition"]
["Low",0.913,0.291,0.055,0.014,0.014,0.014]
["Moderate",0.075,0.519,0.121,0.045,0.045,0.045]
["High",0.012,0.19,0.824,0.94,0.941,0.94]
["Total porosity layer 1 (%)"]
["mean",28.53,28.55,28.73,28.78,28.73,28.78]
["error",16.39,16.41,16.46,16.51,16.46,16.51]
["Low",0.402,0.402,0.397,0.396,0.397,0.396]
["Medium",0.568,0.568,0.573,0.573,0.573,0.573]
["High",0.029,0.029,0.031,0.031,0.031,0.031]
["Water holding capacity layer 1 (mm)"]
["mean",82.27,114.24,274.78,84.33,274.78,84.33]
["error",65.41,115.62,123.24,67.7,123.23,67.7]
["Low",0.715,0.665,0.024,0.702,0.024,0.702]
["Mid",0.266,0.182,0.34,0.276,0.34,0.276]
["High",0.019,0.154,0.636,0.022,0.636,0.022]
["Water status layer 1 (mm)"]
["mean",46.23,47.29,62.2,53.32,62.2,53.32]
["error",25.87,26.21,24.86,25.86,24.86,25.86]
["Low",0.318,0.307,0.119,0.211,0.119,0.211]
["Mid",0.467,0.456,0.386,0.467,0.386,0.467]
["High",0.215,0.237,0.496,0.322,0.496,0.322]
["Total porosity layer 2"]
["mean",0.22,0.22,0.23,0.23,0.23,0.23]
["error",0.16,0.16,0.16,0.16,0.16,0.16]
["Low",0.256,0.26,0.229,0.224,0.229,0.224]
["Mid",0.709,0.706,0.729,0.733,0.729,0.733]
["High",0.035,0.034,0.042,0.043,0.042,0.043]
["Water holding capacity layer 2 (mm)"]
["mean",101.13,151.35,116.21,119.37,116.23,119.37]
["error",92.75,123.4,103.99,106.04,103.99,106.04]
["Low",0.647,0.422,0.57,0.555,0.57,0.555]
["Mid",0.274,0.36,0.314,0.321,0.314,0.321]
["High",0.079,0.218,0.116,0.124,0.116,0.124]
["Water status layer 2 (mm)"]
["mean",35.83,41.25,52.56,49.82,52.58,49.82]
["error",26.18,27.89,28.17,28.62,28.17,28.62]
["Low",0.565,0.47,0.277,0.326,0.277,0.326]
["Mid",0.287,0.314,0.359,0.343,0.359,0.343]
["High",0.148,0.216,0.364,0.331,0.364,0.331]
["Plant available water content (mm)"]
["Low",0.564,0.593,0.04,0.135,0.04,0.135]
["Moderate",0.306,0.256,0.217,0.35,0.216,0.35]
["High",0.13,0.151,0.744,0.514,0.744,0.514]
["Vegetation root depth"]
["Shallow",0.95,0.7,0.65,0.65,0.65,0.65]
["Medium",0.04,0.24,0.27,0.27,0.27,0.27]
["Deep",0.01,0.06,0.08,0.08,0.08,0.08]
["LAYER 1 VULNERABILITY"]
["Low",0.115,0.148,0.33,0.209,0.245,0.159]
["Moderate",0.19,0.202,0.265,0.252,0.271,0.228]
["High",0.245,0.229,0.237,0.264,0.275,0.261]
["VeryHigh",0.45,0.421,0.168,0.275,0.209,0.351]
["Calcium amount relative to requirement layer 2"]
["Medium",0.048,1,0.757,0.757,0.789,0.789]
["Ca effectiveness layer 2"]
["Low",0.937,2E-3,0.069,0.069,0.024,0.024]
["Medium",0.063,0.996,0.924,0.924,0.973,0.973]
["High","-",2E-3,0.006,0.006,2E-3,2E-3]
["Zeta potential layer 2"]
["mean",-53.25,-62,-39.5,-39.5,-48,-48]
["error",23.55,24.41,22.65,22.65,21.35,21.35]
["High",0.45,0.7,0.2,0.2,0.3,0.3]
["Medium",0.45,0.2,0.5,0.5,0.6,0.6]
["Low",0.1,0.1,0.3,0.3,0.1,0.1]
["Spoil dispersivity layer 2 (NTU)"]
["mean",3145.05,3707.46,2313.99,2313.99,2807.61,2807.61]
["error",3025.8,3140.76,2780.11,2780.11,2902.84,2902.84]
["Low",0.203,0.186,0.33,0.33,0.214,0.214]
["Mid",0.232,0.164,0.242,0.242,0.273,0.273]
["High",0.15,0.127,0.151,0.151,0.164,0.164]
["VeryHigh",0.414,0.523,0.278,0.278,0.349,0.349]
["Texture layer 2"]
["mean",0,0,0,0,0,0]
["error",0,0,0,0,0,0]
["Coarse",0.13,0.5,0.13,0.13,0.13,0.13]
["Medium",0.2,0.12,0.2,0.2,0.2,0.2]
["MediumFine",0.24,0.16,0.24,0.24,0.24,0.24]
["Fine",0.18,0.12,0.18,0.18,0.18,0.18]
["VeryFine",0.25,0.1,0.25,0.25,0.25,0.25]
["Pore size frequency layer 2 (mm)"]
["mean",0.23,0.33,0.23,0.23,0.23,0.23]
["error",0.3,0.33,0.3,0.3,0.3,0.3]
["Residual",0.254,0.176,0.254,0.254,0.254,0.254]
["Low",0.282,0.229,0.282,0.282,0.282,0.282]
["Mid",0.267,0.267,0.267,0.267,0.267,0.267]
["High",0.198,0.328,0.198,0.198,0.198,0.198]
["Infiltration rate layer 2 (mm/hr)"]
["mean",12.48,13.24,15.03,12.82,15.41,13.18]
["error",8.41,8.57,8.51,8.47,8.48,8.5]
["Low",0.237,0.216,0.148,0.225,0.138,0.211]
["Mid",0.423,0.395,0.36,0.415,0.347,0.409]
["High",0.34,0.389,0.492,0.36,0.515,0.381]
["LAYER 2 VULNERABILITY"]
["Low",0.127,0.159,0.28,0.166,0.238,0.146]
["Moderate",0.211,0.205,0.277,0.255,0.278,0.236]
["High",0.255,0.231,0.263,0.278,0.277,0.27]
["VeryHigh",0.407,0.405,0.181,0.302,0.206,0.349]
["LAYER 3 VULNERABILITY"]
["Low",0.075,0.22,0.113,0.097,0.098,0.082]
["Moderate",0.126,0.22,0.197,0.166,0.171,0.14]
["High",0.172,0.232,0.241,0.216,0.216,0.187]
["VeryHigh",0.628,0.328,0.449,0.522,0.516,0.59]
["PROFILE VULNERABILITY"]
["mean",61.74,58.14,45.36,53.55,49.32,57.46]
["error",29.89,30.96,30.85,30.94,30.88,30.62]
["Low",0.175,0.22,0.367,0.258,0.307,0.216]
["Medium",0.163,0.168,0.198,0.194,0.202,0.181]
["High",0.179,0.179,0.191,0.197,0.202,0.191]
["VeryHigh",0.483,0.433,0.245,0.351,0.289,0.412]
["Ponding"]
["Yes",0.584,0.584,0.584,0.584,0.584,0.584]
["TUNNEL EXPOSURE"]
["None",0.172,0.172,0.172,0.172,0.172,0.172]
["Low",0.131,0.131,0.131,0.131,0.131,0.131]
["Medium",0.097,0.097,0.097,0.097,0.097,0.097]
["High",0.601,0.601,0.601,0.601,0.601,0.601]
["TUNNELLING RISK"]
["mean",61.56,59.87,53.85,57.64,55.65,59.5]
["error",29.35,29.69,30.08,29.93,30.05,29.71]
["Low",0.163,0.178,0.234,0.198,0.216,0.181]
["Medium",0.179,0.186,0.214,0.198,0.207,0.189]
["High",0.192,0.197,0.217,0.206,0.212,0.199]
["VeryHigh",0.467,0.438,0.335,0.399,0.365,0.431]
["Runon risk"]
["NoRunon",0.9,0.45,0.9,0.9,0.9,0.9]
["Texture layer 1"]
["mean",0,0,0,0,0,0]
["error",0,0,0,0,0,0]
["Coarse",0.13,0.5,0.13,0.13,0.13,0.13]
["Medium",0.2,0.12,0.2,0.2,0.2,0.2]
["MediumFine",0.24,0.16,0.24,0.24,0.24,0.24]
["Fine",0.18,0.12,0.18,0.18,0.18,0.18]
["VeryFine",0.25,0.1,0.25,0.25,0.25,0.25]
["Pore size frequency layer 1 (mm)"]
["mean",0.23,0.33,0.23,0.23,0.23,0.23]
["error",0.3,0.33,0.3,0.3,0.3,0.3]
["Residual",0.254,0.176,0.254,0.254,0.254,0.254]
["Low",0.282,0.229,0.282,0.282,0.282,0.282]
["Mid",0.267,0.267,0.267,0.267,0.267,0.267]
["High",0.198,0.328,0.198,0.198,0.198,0.198]
["Infiltration rate layer 1 (mm/hr)"]
["mean",13.52,14.08,13.42,14.1,12.56,13.23]
["error",8.62,8.65,8.59,8.62,8.54,8.6]
["Low",0.21,0.191,0.211,0.188,0.247,0.221]
["Mid",0.382,0.367,0.389,0.371,0.401,0.389]
["High",0.408,0.441,0.4,0.441,0.352,0.39]
["Runoff risk"]
["VeryLow",0.149,0.145,0.149,0.149,0.149,0.149]
["Low",0.348,0.339,0.348,0.348,0.348,0.348]
["Moderate",0.348,0.339,0.348,0.348,0.348,0.348]
["High",0.155,0.177,0.155,0.155,0.155,0.155]
["Runoff risk with surface management"]
["VeryLow",0.111,0.304,0.624,0.624,0.624,0.624]
["Low",0.235,0.264,0.162,0.162,0.162,0.162]
["Moderate",0.276,0.229,0.124,0.124,0.124,0.124]
["High",0.378,0.203,0.09,0.09,0.09,0.09]
["SURFACE GULLYING EXPOSURE"]
["Nil",0.508,0.164,0.81,0.81,0.81,0.81]
["Low",0.217,0.256,0.091,0.091,0.091,0.091]
["Moderate",0.183,0.262,0.063,0.063,0.063,0.063]
["High",0.092,0.318,0.037,0.037,0.037,0.037]
["SURFACE EROSION RISK"]
["mean",47.39,55.97,32.4,36.63,34.77,38.98]
["error",29.18,29.57,26.78,27.69,27.34,27.94]
["Low",0.292,0.202,0.554,0.466,0.503,0.418]
["Medium",0.248,0.216,0.196,0.227,0.216,0.243]
["High",0.232,0.222,0.149,0.183,0.167,0.202]
["VeryHigh",0.228,0.359,0.101,0.124,0.113,0.137]

{"sheet":"Output","index":15,"n_rows":44,"n_cols":7,"rows_kept":44}
["Scenario",{"$f":"IF(Results!B1>0,Results!B1,\"\")","v":"Scenario 01"},{"$f":"IF(Results!C1>0,Results!C1,\"\")","v":"Scenario 02"},{"$f":"IF(Results!D1>0,Results!D1,\"\")","v":"Scenario 03"},{"$f":"IF(Results!E1>0,Results!E1,\"\")","v":"Scenario 04"},{"$f":"IF(Results!F1>0,Results!F1,\"\")","v":"Scenario 05"},{"$f":"IF(Results!G1>0,Results!G1,\"\")","v":"Scenario 06"}]
["PROFILE VULNERABILITY"]
["Low",{"$f":"OFFSET(Results!$A$1,Lists!$B$133+MATCH($A3,INDIRECT(Lists!$D$133),0)-1,COLUMN()-1)","v":{"v":0.175,"d":"17.50%"}},{"$f":"OFFSET(Results!$A$1,Lists!$B$133+MATCH($A3,INDIRECT(Lists!$D$133),0)-1,COLUMN()-1)","v":{"v":0.22,"d":"22.00%"}},{"$f":"OFFSET(Results!$A$1,Lists!$B$133+MATCH($A3,INDIRECT(Lists!$D$133),0)-1,COLUMN()-1)","v":{"v":0.367,"d":"36.70%"}},{"$f":"OFFSET(Results!$A$1,Lists!$B$133+MATCH($A3,INDIRECT(Lists!$D$133),0)-1,COLUMN()-1)","v":{"v":0.258,"d":"25.80%"}},{"$f":"OFFSET(Results!$A$1,Lists!$B$133+MATCH($A3,INDIRECT(Lists!$D$133),0)-1,COLUMN()-1)","v":{"v":0.307,"d":"30.70%"}},{"$f":"OFFSET(Results!$A$1,Lists!$B$133+MATCH($A3,INDIRECT(Lists!$D$133),0)-1,COLUMN()-1)","v":{"v":0.216,"d":"21.60%"}}]
["Medium",{"$f":"OFFSET(Results!$A$1,Lists!$B$133+MATCH($A4,INDIRECT(Lists!$D$133),0)-1,COLUMN()-1)","v":{"v":0.163,"d":"16.30%"}},{"$f":"OFFSET(Results!$A$1,Lists!$B$133+MATCH($A4,INDIRECT(Lists!$D$133),0)-1,COLUMN()-1)","v":{"v":0.168,"d":"16.80%"}},{"$f":"OFFSET(Results!$A$1,Lists!$B$133+MATCH($A4,INDIRECT(Lists!$D$133),0)-1,COLUMN()-1)","v":{"v":0.198,"d":"19.80%"}},{"$f":"OFFSET(Results!$A$1,Lists!$B$133+MATCH($A4,INDIRECT(Lists!$D$133),0)-1,COLUMN()-1)","v":{"v":0.194,"d":"19.40%"}},{"$f":"OFFSET(Results!$A$1,Lists!$B$133+MATCH($A4,INDIRECT(Lists!$D$133),0)-1,COLUMN()-1)","v":{"v":0.202,"d":"20.20%"}},{"$f":"OFFSET(Results!$A$1,Lists!$B$133+MATCH($A4,INDIRECT(Lists!$D$133),0)-1,COLUMN()-1)","v":{"v":0.181,"d":"18.10%"}}]
["High",{"$f":"OFFSET(Results!$A$1,Lists!$B$133+MATCH($A5,INDIRECT(Lists!$D$133),0)-1,COLUMN()-1)","v":{"v":0.179,"d":"17.90%"}},{"$f":"OFFSET(Results!$A$1,Lists!$B$133+MATCH($A5,INDIRECT(Lists!$D$133),0)-1,COLUMN()-1)","v":{"v":0.179,"d":"17.90%"}},{"$f":"OFFSET(Results!$A$1,Lists!$B$133+MATCH($A5,INDIRECT(Lists!$D$133),0)-1,COLUMN()-1)","v":{"v":0.191,"d":"19.10%"}},{"$f":"OFFSET(Results!$A$1,Lists!$B$133+MATCH($A5,INDIRECT(Lists!$D$133),0)-1,COLUMN()-1)","v":{"v":0.197,"d":"19.70%"}},{"$f":"OFFSET(Results!$A$1,Lists!$B$133+MATCH($A5,INDIRECT(Lists!$D$133),0)-1,COLUMN()-1)","v":{"v":0.202,"d":"20.20%"}},{"$f":"OFFSET(Results!$A$1,Lists!$B$133+MATCH($A5,INDIRECT(Lists!$D$133),0)-1,COLUMN()-1)","v":{"v":0.191,"d":"19.10%"}}]
["VeryHigh",{"$f":"OFFSET(Results!$A$1,Lists!$B$133+MATCH($A6,INDIRECT(Lists!$D$133),0)-1,COLUMN()-1)","v":{"v":0.483,"d":"48.30%"}},{"$f":"OFFSET(Results!$A$1,Lists!$B$133+MATCH($A6,INDIRECT(Lists!$D$133),0)-1,COLUMN()-1)","v":{"v":0.433,"d":"43.30%"}},{"$f":"OFFSET(Results!$A$1,Lists!$B$133+MATCH($A6,INDIRECT(Lists!$D$133),0)-1,COLUMN()-1)","v":{"v":0.245,"d":"24.50%"}},{"$f":"OFFSET(Results!$A$1,Lists!$B$133+MATCH($A6,INDIRECT(Lists!$D$133),0)-1,COLUMN()-1)","v":{"v":0.351,"d":"35.10%"}},{"$f":"OFFSET(Results!$A$1,Lists!$B$133+MATCH($A6,INDIRECT(Lists!$D$133),0)-1,COLUMN()-1)","v":{"v":0.289,"d":"28.90%"}},{"$f":"OFFSET(Results!$A$1,Lists!$B$133+MATCH($A6,INDIRECT(Lists!$D$133),0)-1,COLUMN()-1)","v":{"v":0.412,"d":"41.20%"}}]
["TUNNEL EXPOSURE"]
["None",{"$f":"OFFSET(Results!$A$1,Lists!$B$134+MATCH($A8,INDIRECT(Lists!$D$134),0)-1,COLUMN()-1)","v":{"v":0.172,"d":"17.20%"}},{"$f":"OFFSET(Results!$A$1,Lists!$B$134+MATCH($A8,INDIRECT(Lists!$D$134),0)-1,COLUMN()-1)","v":{"v":0.172,"d":"17.20%"}},{"$f":"OFFSET(Results!$A$1,Lists!$B$134+MATCH($A8,INDIRECT(Lists!$D$134),0)-1,COLUMN()-1)","v":{"v":0.172,"d":"17.20%"}},{"$f":"OFFSET(Results!$A$1,Lists!$B$134+MATCH($A8,INDIRECT(Lists!$D$134),0)-1,COLUMN()-1)","v":{"v":0.172,"d":"17.20%"}},{"$f":"OFFSET(Results!$A$1,Lists!$B$134+MATCH($A8,INDIRECT(Lists!$D$134),0)-1,COLUMN()-1)","v":{"v":0.172,"d":"17.20%"}},{"$f":"OFFSET(Results!$A$1,Lists!$B$134+MATCH($A8,INDIRECT(Lists!$D$134),0)-1,COLUMN()-1)","v":{"v":0.172,"d":"17.20%"}}]
["Low",{"$f":"OFFSET(Results!$A$1,Lists!$B$134+MATCH($A9,INDIRECT(Lists!$D$134),0)-1,COLUMN()-1)","v":{"v":0.131,"d":"13.10%"}},{"$f":"OFFSET(Results!$A$1,Lists!$B$134+MATCH($A9,INDIRECT(Lists!$D$134),0)-1,COLUMN()-1)","v":{"v":0.131,"d":"13.10%"}},{"$f":"OFFSET(Results!$A$1,Lists!$B$134+MATCH($A9,INDIRECT(Lists!$D$134),0)-1,COLUMN()-1)","v":{"v":0.131,"d":"13.10%"}},{"$f":"OFFSET(Results!$A$1,Lists!$B$134+MATCH($A9,INDIRECT(Lists!$D$134),0)-1,COLUMN()-1)","v":{"v":0.131,"d":"13.10%"}},{"$f":"OFFSET(Results!$A$1,Lists!$B$134+MATCH($A9,INDIRECT(Lists!$D$134),0)-1,COLUMN()-1)","v":{"v":0.131,"d":"13.10%"}},{"$f":"OFFSET(Results!$A$1,Lists!$B$134+MATCH($A9,INDIRECT(Lists!$D$134),0)-1,COLUMN()-1)","v":{"v":0.131,"d":"13.10%"}}]
["Medium",{"$f":"OFFSET(Results!$A$1,Lists!$B$134+MATCH($A10,INDIRECT(Lists!$D$134),0)-1,COLUMN()-1)","v":{"v":0.097,"d":"9.70%"}},{"$f":"OFFSET(Results!$A$1,Lists!$B$134+MATCH($A10,INDIRECT(Lists!$D$134),0)-1,COLUMN()-1)","v":{"v":0.097,"d":"9.70%"}},{"$f":"OFFSET(Results!$A$1,Lists!$B$134+MATCH($A10,INDIRECT(Lists!$D$134),0)-1,COLUMN()-1)","v":{"v":0.097,"d":"9.70%"}},{"$f":"OFFSET(Results!$A$1,Lists!$B$134+MATCH($A10,INDIRECT(Lists!$D$134),0)-1,COLUMN()-1)","v":{"v":0.097,"d":"9.70%"}},{"$f":"OFFSET(Results!$A$1,Lists!$B$134+MATCH($A10,INDIRECT(Lists!$D$134),0)-1,COLUMN()-1)","v":{"v":0.097,"d":"9.70%"}},{"$f":"OFFSET(Results!$A$1,Lists!$B$134+MATCH($A10,INDIRECT(Lists!$D$134),0)-1,COLUMN()-1)","v":{"v":0.097,"d":"9.70%"}}]
["High",{"$f":"OFFSET(Results!$A$1,Lists!$B$134+MATCH($A11,INDIRECT(Lists!$D$134),0)-1,COLUMN()-1)","v":{"v":0.601,"d":"60.10%"}},{"$f":"OFFSET(Results!$A$1,Lists!$B$134+MATCH($A11,INDIRECT(Lists!$D$134),0)-1,COLUMN()-1)","v":{"v":0.601,"d":"60.10%"}},{"$f":"OFFSET(Results!$A$1,Lists!$B$134+MATCH($A11,INDIRECT(Lists!$D$134),0)-1,COLUMN()-1)","v":{"v":0.601,"d":"60.10%"}},{"$f":"OFFSET(Results!$A$1,Lists!$B$134+MATCH($A11,INDIRECT(Lists!$D$134),0)-1,COLUMN()-1)","v":{"v":0.601,"d":"60.10%"}},{"$f":"OFFSET(Results!$A$1,Lists!$B$134+MATCH($A11,INDIRECT(Lists!$D$134),0)-1,COLUMN()-1)","v":{"v":0.601,"d":"60.10%"}},{"$f":"OFFSET(Results!$A$1,Lists!$B$134+MATCH($A11,INDIRECT(Lists!$D$134),0)-1,COLUMN()-1)","v":{"v":0.601,"d":"60.10%"}}]
["TUNNELLING RISK"]
["Low",{"$f":"OFFSET(Results!$A$1,Lists!$B$135+MATCH($A13,INDIRECT(Lists!$D$135),0)-1,COLUMN()-1)","v":{"v":0.163,"d":"16.30%"}},{"$f":"OFFSET(Results!$A$1,Lists!$B$135+MATCH($A13,INDIRECT(Lists!$D$135),0)-1,COLUMN()-1)","v":{"v":0.178,"d":"17.80%"}},{"$f":"OFFSET(Results!$A$1,Lists!$B$135+MATCH($A13,INDIRECT(Lists!$D$135),0)-1,COLUMN()-1)","v":{"v":0.234,"d":"23.40%"}},{"$f":"OFFSET(Results!$A$1,Lists!$B$135+MATCH($A13,INDIRECT(Lists!$D$135),0)-1,COLUMN()-1)","v":{"v":0.198,"d":"19.80%"}},{"$f":"OFFSET(Results!$A$1,Lists!$B$135+MATCH($A13,INDIRECT(Lists!$D$135),0)-1,COLUMN()-1)","v":{"v":0.216,"d":"21.60%"}},{"$f":"OFFSET(Results!$A$1,Lists!$B$135+MATCH($A13,INDIRECT(Lists!$D$135),0)-1,COLUMN()-1)","v":{"v":0.181,"d":"18.10%"}}]
["Medium",{"$f":"OFFSET(Results!$A$1,Lists!$B$135+MATCH($A14,INDIRECT(Lists!$D$135),0)-1,COLUMN()-1)","v":{"v":0.179,"d":"17.90%"}},{"$f":"OFFSET(Results!$A$1,Lists!$B$135+MATCH($A14,INDIRECT(Lists!$D$135),0)-1,COLUMN()-1)","v":{"v":0.186,"d":"18.60%"}},{"$f":"OFFSET(Results!$A$1,Lists!$B$135+MATCH($A14,INDIRECT(Lists!$D$135),0)-1,COLUMN()-1)","v":{"v":0.214,"d":"21.40%"}},{"$f":"OFFSET(Results!$A$1,Lists!$B$135+MATCH($A14,INDIRECT(Lists!$D$135),0)-1,COLUMN()-1)","v":{"v":0.198,"d":"19.80%"}},{"$f":"OFFSET(Results!$A$1,Lists!$B$135+MATCH($A14,INDIRECT(Lists!$D$135),0)-1,COLUMN()-1)","v":{"v":0.207,"d":"20.70%"}},{"$f":"OFFSET(Results!$A$1,Lists!$B$135+MATCH($A14,INDIRECT(Lists!$D$135),0)-1,COLUMN()-1)","v":{"v":0.189,"d":"18.90%"}}]
["High",{"$f":"OFFSET(Results!$A$1,Lists!$B$135+MATCH($A15,INDIRECT(Lists!$D$135),0)-1,COLUMN()-1)","v":{"v":0.192,"d":"19.20%"}},{"$f":"OFFSET(Results!$A$1,Lists!$B$135+MATCH($A15,INDIRECT(Lists!$D$135),0)-1,COLUMN()-1)","v":{"v":0.197,"d":"19.70%"}},{"$f":"OFFSET(Results!$A$1,Lists!$B$135+MATCH($A15,INDIRECT(Lists!$D$135),0)-1,COLUMN()-1)","v":{"v":0.217,"d":"21.70%"}},{"$f":"OFFSET(Results!$A$1,Lists!$B$135+MATCH($A15,INDIRECT(Lists!$D$135),0)-1,COLUMN()-1)","v":{"v":0.206,"d":"20.60%"}},{"$f":"OFFSET(Results!$A$1,Lists!$B$135+MATCH($A15,INDIRECT(Lists!$D$135),0)-1,COLUMN()-1)","v":{"v":0.212,"d":"21.20%"}},{"$f":"OFFSET(Results!$A$1,Lists!$B$135+MATCH($A15,INDIRECT(Lists!$D$135),0)-1,COLUMN()-1)","v":{"v":0.199,"d":"19.90%"}}]
["VeryHigh",{"$f":"OFFSET(Results!$A$1,Lists!$B$135+MATCH($A16,INDIRECT(Lists!$D$135),0)-1,COLUMN()-1)","v":{"v":0.467,"d":"46.70%"}},{"$f":"OFFSET(Results!$A$1,Lists!$B$135+MATCH($A16,INDIRECT(Lists!$D$135),0)-1,COLUMN()-1)","v":{"v":0.438,"d":"43.80%"}},{"$f":"OFFSET(Results!$A$1,Lists!$B$135+MATCH($A16,INDIRECT(Lists!$D$135),0)-1,COLUMN()-1)","v":{"v":0.335,"d":"33.50%"}},{"$f":"OFFSET(Results!$A$1,Lists!$B$135+MATCH($A16,INDIRECT(Lists!$D$135),0)-1,COLUMN()-1)","v":{"v":0.399,"d":"39.90%"}},{"$f":"OFFSET(Results!$A$1,Lists!$B$135+MATCH($A16,INDIRECT(Lists!$D$135),0)-1,COLUMN()-1)","v":{"v":0.365,"d":"36.50%"}},{"$f":"OFFSET(Results!$A$1,Lists!$B$135+MATCH($A16,INDIRECT(Lists!$D$135),0)-1,COLUMN()-1)","v":{"v":0.431,"d":"43.10%"}}]
["mean",{"$f":"OFFSET(Results!$A$1,Lists!$B$135+MATCH($A17,INDIRECT(Lists!$D$135),0)-1,COLUMN()-1)/100","v":{"v":0.6156,"d":"61.56%"}},{"$f":"OFFSET(Results!$A$1,Lists!$B$135+MATCH($A17,INDIRECT(Lists!$D$135),0)-1,COLUMN()-1)/100","v":{"v":0.5987,"d":"59.87%"}},{"$f":"OFFSET(Results!$A$1,Lists!$B$135+MATCH($A17,INDIRECT(Lists!$D$135),0)-1,COLUMN()-1)/100","v":{"v":0.5385,"d":"53.85%"}},{"$f":"OFFSET(Results!$A$1,Lists!$B$135+MATCH($A17,INDIRECT(Lists!$D$135),0)-1,COLUMN()-1)/100","v":{"v":0.5764,"d":"57.64%"}},{"$f":"OFFSET(Results!$A$1,Lists!$B$135+MATCH($A17,INDIRECT(Lists!$D$135),0)-1,COLUMN()-1)/100","v":{"v":0.5565,"d":"55.65%"}},{"$f":"OFFSET(Results!$A$1,Lists!$B$135+MATCH($A17,INDIRECT(Lists!$D$135),0)-1,COLUMN()-1)/100","v":{"v":0.595,"d":"59.50%"}}]
["Minimum",{"$f":"MIN($B17:$H17)","v":{"v":0.5385,"d":"53.85%"}},{"v":0.5385,"d":"53.85%"},{"v":0.5385,"d":"53.85%"},{"v":0.5385,"d":"53.85%"},{"v":0.5385,"d":"53.85%"},{"v":0.5385,"d":"53.85%"}]
["Ratio",{"$f":"IF(B18=\"\",\"\",B17/B18)","v":{"v":1.1431754874651812,"d":"1.14"}},{"$f":"IF(C18=\"\",\"\",C17/C18)","v":{"v":1.1117920148560818,"d":"1.11"}},{"v":1,"d":"1.00"},{"v":1.070380687093779,"d":"1.07"},{"v":1.033426183844011,"d":"1.03"},{"v":1.104921077065924,"d":"1.10"}]
[]
["Scenario",{"$f":"IF(Results!B1>0,Results!B1,\"\")","v":"Scenario 01"},{"$f":"IF(Results!C1>0,Results!C1,\"\")","v":"Scenario 02"},{"$f":"IF(Results!D1>0,Results!D1,\"\")","v":"Scenario 03"},{"$f":"IF(Results!E1>0,Results!E1,\"\")","v":"Scenario 04"},{"$f":"IF(Results!F1>0,Results!F1,\"\")","v":"Scenario 05"},{"$f":"IF(Results!G1>0,Results!G1,\"\")","v":"Scenario 06"}]
["LAYER 1 VULNERABILITY"]
["Low",{"$f":"OFFSET(Results!$A$1,Lists!$B$136+MATCH($A23,INDIRECT(Lists!$D$136),0)-1,COLUMN()-1)","v":{"v":0.115,"d":"11.50%"}},{"$f":"OFFSET(Results!$A$1,Lists!$B$136+MATCH($A23,INDIRECT(Lists!$D$136),0)-1,COLUMN()-1)","v":{"v":0.148,"d":"14.80%"}},{"$f":"OFFSET(Results!$A$1,Lists!$B$136+MATCH($A23,INDIRECT(Lists!$D$136),0)-1,COLUMN()-1)","v":{"v":0.33,"d":"33.00%"}},{"$f":"OFFSET(Results!$A$1,Lists!$B$136+MATCH($A23,INDIRECT(Lists!$D$136),0)-1,COLUMN()-1)","v":{"v":0.209,"d":"20.90%"}},{"$f":"OFFSET(Results!$A$1,Lists!$B$136+MATCH($A23,INDIRECT(Lists!$D$136),0)-1,COLUMN()-1)","v":{"v":0.245,"d":"24.50%"}},{"$f":"OFFSET(Results!$A$1,Lists!$B$136+MATCH($A23,INDIRECT(Lists!$D$136),0)-1,COLUMN()-1)","v":{"v":0.159,"d":"15.90%"}}]
["Moderate",{"$f":"OFFSET(Results!$A$1,Lists!$B$136+MATCH($A24,INDIRECT(Lists!$D$136),0)-1,COLUMN()-1)","v":{"v":0.19,"d":"19.00%"}},{"$f":"OFFSET(Results!$A$1,Lists!$B$136+MATCH($A24,INDIRECT(Lists!$D$136),0)-1,COLUMN()-1)","v":{"v":0.202,"d":"20.20%"}},{"$f":"OFFSET(Results!$A$1,Lists!$B$136+MATCH($A24,INDIRECT(Lists!$D$136),0)-1,COLUMN()-1)","v":{"v":0.265,"d":"26.50%"}},{"$f":"OFFSET(Results!$A$1,Lists!$B$136+MATCH($A24,INDIRECT(Lists!$D$136),0)-1,COLUMN()-1)","v":{"v":0.252,"d":"25.20%"}},{"$f":"OFFSET(Results!$A$1,Lists!$B$136+MATCH($A24,INDIRECT(Lists!$D$136),0)-1,COLUMN()-1)","v":{"v":0.271,"d":"27.10%"}},{"$f":"OFFSET(Results!$A$1,Lists!$B$136+MATCH($A24,INDIRECT(Lists!$D$136),0)-1,COLUMN()-1)","v":{"v":0.228,"d":"22.80%"}}]
["High",{"$f":"OFFSET(Results!$A$1,Lists!$B$136+MATCH($A25,INDIRECT(Lists!$D$136),0)-1,COLUMN()-1)","v":{"v":0.245,"d":"24.50%"}},{"$f":"OFFSET(Results!$A$1,Lists!$B$136+MATCH($A25,INDIRECT(Lists!$D$136),0)-1,COLUMN()-1)","v":{"v":0.229,"d":"22.90%"}},{"$f":"OFFSET(Results!$A$1,Lists!$B$136+MATCH($A25,INDIRECT(Lists!$D$136),0)-1,COLUMN()-1)","v":{"v":0.237,"d":"23.70%"}},{"$f":"OFFSET(Results!$A$1,Lists!$B$136+MATCH($A25,INDIRECT(Lists!$D$136),0)-1,COLUMN()-1)","v":{"v":0.264,"d":"26.40%"}},{"$f":"OFFSET(Results!$A$1,Lists!$B$136+MATCH($A25,INDIRECT(Lists!$D$136),0)-1,COLUMN()-1)","v":{"v":0.275,"d":"27.50%"}},{"$f":"OFFSET(Results!$A$1,Lists!$B$136+MATCH($A25,INDIRECT(Lists!$D$136),0)-1,COLUMN()-1)","v":{"v":0.261,"d":"26.10%"}}]
["VeryHigh",{"$f":"OFFSET(Results!$A$1,Lists!$B$136+MATCH($A26,INDIRECT(Lists!$D$136),0)-1,COLUMN()-1)","v":{"v":0.45,"d":"45.00%"}},{"$f":"OFFSET(Results!$A$1,Lists!$B$136+MATCH($A26,INDIRECT(Lists!$D$136),0)-1,COLUMN()-1)","v":{"v":0.421,"d":"42.10%"}},{"$f":"OFFSET(Results!$A$1,Lists!$B$136+MATCH($A26,INDIRECT(Lists!$D$136),0)-1,COLUMN()-1)","v":{"v":0.168,"d":"16.80%"}},{"$f":"OFFSET(Results!$A$1,Lists!$B$136+MATCH($A26,INDIRECT(Lists!$D$136),0)-1,COLUMN()-1)","v":{"v":0.275,"d":"27.50%"}},{"$f":"OFFSET(Results!$A$1,Lists!$B$136+MATCH($A26,INDIRECT(Lists!$D$136),0)-1,COLUMN()-1)","v":{"v":0.209,"d":"20.90%"}},{"$f":"OFFSET(Results!$A$1,Lists!$B$136+MATCH($A26,INDIRECT(Lists!$D$136),0)-1,COLUMN()-1)","v":{"v":0.351,"d":"35.10%"}}]
["SURFACE GULLYING EXPOSURE"]
["Nil",{"$f":"OFFSET(Results!$A$1,Lists!$B$137+MATCH($A28,INDIRECT(Lists!$D$137),0)-1,COLUMN()-1)","v":{"v":0.508,"d":"50.80%"}},{"$f":"OFFSET(Results!$A$1,Lists!$B$137+MATCH($A28,INDIRECT(Lists!$D$137),0)-1,COLUMN()-1)","v":{"v":0.164,"d":"16.40%"}},{"$f":"OFFSET(Results!$A$1,Lists!$B$137+MATCH($A28,INDIRECT(Lists!$D$137),0)-1,COLUMN()-1)","v":{"v":0.81,"d":"81.00%"}},{"$f":"OFFSET(Results!$A$1,Lists!$B$137+MATCH($A28,INDIRECT(Lists!$D$137),0)-1,COLUMN()-1)","v":{"v":0.81,"d":"81.00%"}},{"$f":"OFFSET(Results!$A$1,Lists!$B$137+MATCH($A28,INDIRECT(Lists!$D$137),0)-1,COLUMN()-1)","v":{"v":0.81,"d":"81.00%"}},{"$f":"OFFSET(Results!$A$1,Lists!$B$137+MATCH($A28,INDIRECT(Lists!$D$137),0)-1,COLUMN()-1)","v":{"v":0.81,"d":"81.00%"}}]
["Low",{"$f":"OFFSET(Results!$A$1,Lists!$B$137+MATCH($A29,INDIRECT(Lists!$D$137),0)-1,COLUMN()-1)","v":{"v":0.217,"d":"21.70%"}},{"$f":"OFFSET(Results!$A$1,Lists!$B$137+MATCH($A29,INDIRECT(Lists!$D$137),0)-1,COLUMN()-1)","v":{"v":0.256,"d":"25.60%"}},{"$f":"OFFSET(Results!$A$1,Lists!$B$137+MATCH($A29,INDIRECT(Lists!$D$137),0)-1,COLUMN()-1)","v":{"v":0.091,"d":"9.10%"}},{"$f":"OFFSET(Results!$A$1,Lists!$B$137+MATCH($A29,INDIRECT(Lists!$D$137),0)-1,COLUMN()-1)","v":{"v":0.091,"d":"9.10%"}},{"$f":"OFFSET(Results!$A$1,Lists!$B$137+MATCH($A29,INDIRECT(Lists!$D$137),0)-1,COLUMN()-1)","v":{"v":0.091,"d":"9.10%"}},{"$f":"OFFSET(Results!$A$1,Lists!$B$137+MATCH($A29,INDIRECT(Lists!$D$137),0)-1,COLUMN()-1)","v":{"v":0.091,"d":"9.10%"}}]
["Moderate",{"$f":"OFFSET(Results!$A$1,Lists!$B$137+MATCH($A30,INDIRECT(Lists!$D$137),0)-1,COLUMN()-1)","v":{"v":0.183,"d":"18.30%"}},{"$f":"OFFSET(Results!$A$1,Lists!$B$137+MATCH($A30,INDIRECT(Lists!$D$137),0)-1,COLUMN()-1)","v":{"v":0.262,"d":"26.20%"}},{"$f":"OFFSET(Results!$A$1,Lists!$B$137+MATCH($A30,INDIRECT(Lists!$D$137),0)-1,COLUMN()-1)","v":{"v":0.063,"d":"6.30%"}},{"$f":"OFFSET(Results!$A$1,Lists!$B$137+MATCH($A30,INDIRECT(Lists!$D$137),0)-1,COLUMN()-1)","v":{"v":0.063,"d":"6.30%"}},{"$f":"OFFSET(Results!$A$1,Lists!$B$137+MATCH($A30,INDIRECT(Lists!$D$137),0)-1,COLUMN()-1)","v":{"v":0.063,"d":"6.30%"}},{"$f":"OFFSET(Results!$A$1,Lists!$B$137+MATCH($A30,INDIRECT(Lists!$D$137),0)-1,COLUMN()-1)","v":{"v":0.063,"d":"6.30%"}}]
["High",{"$f":"OFFSET(Results!$A$1,Lists!$B$137+MATCH($A31,INDIRECT(Lists!$D$137),0)-1,COLUMN()-1)","v":{"v":0.092,"d":"9.20%"}},{"$f":"OFFSET(Results!$A$1,Lists!$B$137+MATCH($A31,INDIRECT(Lists!$D$137),0)-1,COLUMN()-1)","v":{"v":0.318,"d":"31.80%"}},{"$f":"OFFSET(Results!$A$1,Lists!$B$137+MATCH($A31,INDIRECT(Lists!$D$137),0)-1,COLUMN()-1)","v":{"v":0.037,"d":"3.70%"}},{"$f":"OFFSET(Results!$A$1,Lists!$B$137+MATCH($A31,INDIRECT(Lists!$D$137),0)-1,COLUMN()-1)","v":{"v":0.037,"d":"3.70%"}},{"$f":"OFFSET(Results!$A$1,Lists!$B$137+MATCH($A31,INDIRECT(Lists!$D$137),0)-1,COLUMN()-1)","v":{"v":0.037,"d":"3.70%"}},{"$f":"OFFSET(Results!$A$1,Lists!$B$137+MATCH($A31,INDIRECT(Lists!$D$137),0)-1,COLUMN()-1)","v":{"v":0.037,"d":"3.70%"}}]
["SURFACE EROSION RISK"]
["Low",{"$f":"OFFSET(Results!$A$1,Lists!$B$138+MATCH($A33,INDIRECT(Lists!$D$138),0)-1,COLUMN()-1)","v":{"v":0.292,"d":"29.20%"}},{"$f":"OFFSET(Results!$A$1,Lists!$B$138+MATCH($A33,INDIRECT(Lists!$D$138),0)-1,COLUMN()-1)","v":{"v":0.202,"d":"20.20%"}},{"$f":"OFFSET(Results!$A$1,Lists!$B$138+MATCH($A33,INDIRECT(Lists!$D$138),0)-1,COLUMN()-1)","v":{"v":0.554,"d":"55.40%"}},{"$f":"OFFSET(Results!$A$1,Lists!$B$138+MATCH($A33,INDIRECT(Lists!$D$138),0)-1,COLUMN()-1)","v":{"v":0.466,"d":"46.60%"}},{"$f":"OFFSET(Results!$A$1,Lists!$B$138+MATCH($A33,INDIRECT(Lists!$D$138),0)-1,COLUMN()-1)","v":{"v":0.503,"d":"50.30%"}},{"$f":"OFFSET(Results!$A$1,Lists!$B$138+MATCH($A33,INDIRECT(Lists!$D$138),0)-1,COLUMN()-1)","v":{"v":0.418,"d":"41.80%"}}]
["Medium",{"$f":"OFFSET(Results!$A$1,Lists!$B$138+MATCH($A34,INDIRECT(Lists!$D$138),0)-1,COLUMN()-1)","v":{"v":0.248,"d":"24.80%"}},{"$f":"OFFSET(Results!$A$1,Lists!$B$138+MATCH($A34,INDIRECT(Lists!$D$138),0)-1,COLUMN()-1)","v":{"v":0.216,"d":"21.60%"}},{"$f":"OFFSET(Results!$A$1,Lists!$B$138+MATCH($A34,INDIRECT(Lists!$D$138),0)-1,COLUMN()-1)","v":{"v":0.196,"d":"19.60%"}},{"$f":"OFFSET(Results!$A$1,Lists!$B$138+MATCH($A34,INDIRECT(Lists!$D$138),0)-1,COLUMN()-1)","v":{"v":0.227,"d":"22.70%"}},{"$f":"OFFSET(Results!$A$1,Lists!$B$138+MATCH($A34,INDIRECT(Lists!$D$138),0)-1,COLUMN()-1)","v":{"v":0.216,"d":"21.60%"}},{"$f":"OFFSET(Results!$A$1,Lists!$B$138+MATCH($A34,INDIRECT(Lists!$D$138),0)-1,COLUMN()-1)","v":{"v":0.243,"d":"24.30%"}}]
["High",{"$f":"OFFSET(Results!$A$1,Lists!$B$138+MATCH($A35,INDIRECT(Lists!$D$138),0)-1,COLUMN()-1)","v":{"v":0.232,"d":"23.20%"}},{"$f":"OFFSET(Results!$A$1,Lists!$B$138+MATCH($A35,INDIRECT(Lists!$D$138),0)-1,COLUMN()-1)","v":{"v":0.222,"d":"22.20%"}},{"$f":"OFFSET(Results!$A$1,Lists!$B$138+MATCH($A35,INDIRECT(Lists!$D$138),0)-1,COLUMN()-1)","v":{"v":0.149,"d":"14.90%"}},{"$f":"OFFSET(Results!$A$1,Lists!$B$138+MATCH($A35,INDIRECT(Lists!$D$138),0)-1,COLUMN()-1)","v":{"v":0.183,"d":"18.30%"}},{"$f":"OFFSET(Results!$A$1,Lists!$B$138+MATCH($A35,INDIRECT(Lists!$D$138),0)-1,COLUMN()-1)","v":{"v":0.167,"d":"16.70%"}},{"$f":"OFFSET(Results!$A$1,Lists!$B$138+MATCH($A35,INDIRECT(Lists!$D$138),0)-1,COLUMN()-1)","v":{"v":0.202,"d":"20.20%"}}]
["VeryHigh",{"$f":"OFFSET(Results!$A$1,Lists!$B$138+MATCH($A36,INDIRECT(Lists!$D$138),0)-1,COLUMN()-1)","v":{"v":0.228,"d":"22.80%"}},{"$f":"OFFSET(Results!$A$1,Lists!$B$138+MATCH($A36,INDIRECT(Lists!$D$138),0)-1,COLUMN()-1)","v":{"v":0.359,"d":"35.90%"}},{"$f":"OFFSET(Results!$A$1,Lists!$B$138+MATCH($A36,INDIRECT(Lists!$D$138),0)-1,COLUMN()-1)","v":{"v":0.101,"d":"10.10%"}},{"$f":"OFFSET(Results!$A$1,Lists!$B$138+MATCH($A36,INDIRECT(Lists!$D$138),0)-1,COLUMN()-1)","v":{"v":0.124,"d":"12.40%"}},{"$f":"OFFSET(Results!$A$1,Lists!$B$138+MATCH($A36,INDIRECT(Lists!$D$138),0)-1,COLUMN()-1)","v":{"v":0.113,"d":"11.30%"}},{"$f":"OFFSET(Results!$A$1,Lists!$B$138+MATCH($A36,INDIRECT(Lists!$D$138),0)-1,COLUMN()-1)","v":{"v":0.137,"d":"13.70%"}}]
["mean",{"$f":"OFFSET(Results!$A$1,Lists!$B$138+MATCH($A37,INDIRECT(Lists!$D$138),0)-1,COLUMN()-1)/100","v":{"v":0.4739,"d":"47.39%"}},{"$f":"OFFSET(Results!$A$1,Lists!$B$138+MATCH($A37,INDIRECT(Lists!$D$138),0)-1,COLUMN()-1)/100","v":{"v":0.5597,"d":"55.97%"}},{"$f":"OFFSET(Results!$A$1,Lists!$B$138+MATCH($A37,INDIRECT(Lists!$D$138),0)-1,COLUMN()-1)/100","v":{"v":0.324,"d":"32.40%"}},{"$f":"OFFSET(Results!$A$1,Lists!$B$138+MATCH($A37,INDIRECT(Lists!$D$138),0)-1,COLUMN()-1)/100","v":{"v":0.3663,"d":"36.63%"}},{"$f":"OFFSET(Results!$A$1,Lists!$B$138+MATCH($A37,INDIRECT(Lists!$D$138),0)-1,COLUMN()-1)/100","v":{"v":0.3477,"d":"34.77%"}},{"$f":"OFFSET(Results!$A$1,Lists!$B$138+MATCH($A37,INDIRECT(Lists!$D$138),0)-1,COLUMN()-1)/100","v":{"v":0.3898,"d":"38.98%"}}]
["Minimum",{"$f":"MIN($B37:$H37)","v":{"v":0.324,"d":"32.40%"}},{"v":0.324,"d":"32.40%"},{"v":0.324,"d":"32.40%"},{"v":0.324,"d":"32.40%"},{"v":0.324,"d":"32.40%"},{"v":0.324,"d":"32.40%"}]
["Ratio",{"$f":"IF(B38=\"\",\"\",B37/B38)","v":{"v":1.4626543209876541,"d":"1.46"}},{"$f":"IF(C38=\"\",\"\",C37/C38)","v":{"v":1.727469135802469,"d":"1.73"}},{"v":1,"d":"1.00"},{"v":1.1305555555555555,"d":"1.13"},{"v":1.0731481481481482,"d":"1.07"},{"v":1.2030864197530864,"d":"1.20"}]
[]
[]
[null,{"$f":"IF(Results!B1>0,Results!B1,\"\")","v":"Scenario 01"},{"$f":"IF(Results!C1>0,Results!C1,\"\")","v":"Scenario 02"},{"$f":"IF(Results!D1>0,Results!D1,\"\")","v":"Scenario 03"},{"$f":"IF(Results!E1>0,Results!E1,\"\")","v":"Scenario 04"},{"$f":"IF(Results!F1>0,Results!F1,\"\")","v":"Scenario 05"},{"$f":"IF(Results!G1>0,Results!G1,\"\")","v":"Scenario 06"}]
["Relative tunnelling risk ratio",{"$f":"B19","v":{"v":1.1431754874651812,"d":"1.14"}},{"$f":"C19","v":{"v":1.1117920148560818,"d":"1.11"}},{"$f":"D19","v":{"v":1,"d":"1.00"}},{"v":1.070380687093779,"d":"1.07"},{"v":1.033426183844011,"d":"1.03"},{"v":1.104921077065924,"d":"1.10"}]
["Relative surface gullying risk ratio",{"$f":"B39","v":{"v":1.4626543209876541,"d":"1.46"}},{"$f":"C39","v":{"v":1.727469135802469,"d":"1.73"}},{"v":1,"d":"1.00"},{"v":1.1305555555555555,"d":"1.13"},{"v":1.0731481481481482,"d":"1.07"},{"v":1.2030864197530864,"d":"1.20"}]